lists.linaro.org
Sign In
Sign Up
Sign In
Sign Up
Manage this list
×
Keyboard Shortcuts
Thread View
j
: Next unread message
k
: Previous unread message
j a
: Jump to all threads
j l
: Jump to MailingList overview
2025
April
March
February
January
2024
December
November
October
September
August
July
June
May
April
March
February
January
2023
December
November
October
September
August
July
June
May
April
March
February
January
2022
December
November
October
September
August
July
June
May
April
March
February
January
2021
December
November
October
September
August
July
June
May
April
March
February
January
2020
December
November
October
September
August
July
June
May
April
March
February
January
2019
December
November
October
September
August
July
June
May
April
March
February
January
2018
December
November
October
September
August
July
June
May
April
March
February
January
2017
December
November
October
September
August
July
June
May
April
March
February
January
2016
December
November
October
September
August
July
June
May
April
March
February
January
2015
December
November
October
September
August
July
June
May
April
March
February
January
2014
December
November
October
September
August
July
June
May
April
March
February
January
2013
December
November
October
September
August
List overview
Download
Kernel-build-reports
November 2023
----- 2025 -----
April 2025
March 2025
February 2025
January 2025
----- 2024 -----
December 2024
November 2024
October 2024
September 2024
August 2024
July 2024
June 2024
May 2024
April 2024
March 2024
February 2024
January 2024
----- 2023 -----
December 2023
November 2023
October 2023
September 2023
August 2023
July 2023
June 2023
May 2023
April 2023
March 2023
February 2023
January 2023
----- 2022 -----
December 2022
November 2022
October 2022
September 2022
August 2022
July 2022
June 2022
May 2022
April 2022
March 2022
February 2022
January 2022
----- 2021 -----
December 2021
November 2021
October 2021
September 2021
August 2021
July 2021
June 2021
May 2021
April 2021
March 2021
February 2021
January 2021
----- 2020 -----
December 2020
November 2020
October 2020
September 2020
August 2020
July 2020
June 2020
May 2020
April 2020
March 2020
February 2020
January 2020
----- 2019 -----
December 2019
November 2019
October 2019
September 2019
August 2019
July 2019
June 2019
May 2019
April 2019
March 2019
February 2019
January 2019
----- 2018 -----
December 2018
November 2018
October 2018
September 2018
August 2018
July 2018
June 2018
May 2018
April 2018
March 2018
February 2018
January 2018
----- 2017 -----
December 2017
November 2017
October 2017
September 2017
August 2017
July 2017
June 2017
May 2017
April 2017
March 2017
February 2017
January 2017
----- 2016 -----
December 2016
November 2016
October 2016
September 2016
August 2016
July 2016
June 2016
May 2016
April 2016
March 2016
February 2016
January 2016
----- 2015 -----
December 2015
November 2015
October 2015
September 2015
August 2015
July 2015
June 2015
May 2015
April 2015
March 2015
February 2015
January 2015
----- 2014 -----
December 2014
November 2014
October 2014
September 2014
August 2014
July 2014
June 2014
May 2014
April 2014
March 2014
February 2014
January 2014
----- 2013 -----
December 2013
November 2013
October 2013
September 2013
August 2013
kernel-build-reports@lists.linaro.org
1 participants
522 discussions
Start a n
N
ew thread
stable-rc/queue/6.1 build: 20 builds: 0 failed, 20 passed, 1 warning (v6.1.63-367-g5fee4f75be63)
by kernelci.org bot
stable-rc/queue/6.1 build: 20 builds: 0 failed, 20 passed, 1 warning (v6.1.63-367-g5fee4f75be63) Full Build Summary:
https://kernelci.org/build/stable-rc/branch/queue%2F6.1/kernel/v6.1.63-367-…
Tree: stable-rc Branch: queue/6.1 Git Describe: v6.1.63-367-g5fee4f75be63 Git Commit: 5fee4f75be6323b6e3e3de6b73da6df8602a0c44 Git URL:
https://git.kernel.org/pub/scm/linux/kernel/git/stable/linux-stable-rc.git
Built: 7 unique architectures Warnings Detected: arc: arm64: arm: i386: mips: 32r2el_defconfig (gcc-10): 1 warning riscv: x86_64: Warnings summary: 1 arch/mips/boot/dts/img/boston.dts:128.19-178.5: Warning (pci_device_reg): /pci@14000000/pci2_root@0,0,0: PCI unit address format error, expected "0,0" ================================================================================ Detailed per-defconfig build reports: -------------------------------------------------------------------------------- 32r2el_defconfig (mips, gcc-10) — PASS, 0 errors, 1 warning, 0 section mismatches Warnings: arch/mips/boot/dts/img/boston.dts:128.19-178.5: Warning (pci_device_reg): /pci@14000000/pci2_root@0,0,0: PCI unit address format error, expected "0,0" -------------------------------------------------------------------------------- allnoconfig (i386, gcc-10) — PASS, 0 errors, 0 warnings, 0 section mismatches -------------------------------------------------------------------------------- allnoconfig (x86_64, gcc-10) — PASS, 0 errors, 0 warnings, 0 section mismatches -------------------------------------------------------------------------------- defconfig (riscv, gcc-10) — PASS, 0 errors, 0 warnings, 0 section mismatches -------------------------------------------------------------------------------- defconfig (arm64, gcc-10) — PASS, 0 errors, 0 warnings, 0 section mismatches -------------------------------------------------------------------------------- defconfig+arm64-chromebook (arm64, gcc-10) — PASS, 0 errors, 0 warnings, 0 section mismatches -------------------------------------------------------------------------------- haps_hs_smp_defconfig (arc, gcc-10) — PASS, 0 errors, 0 warnings, 0 section mismatches -------------------------------------------------------------------------------- i386_defconfig (i386, gcc-10) — PASS, 0 errors, 0 warnings, 0 section mismatches -------------------------------------------------------------------------------- imx_v6_v7_defconfig (arm, gcc-10) — PASS, 0 errors, 0 warnings, 0 section mismatches -------------------------------------------------------------------------------- multi_v5_defconfig (arm, gcc-10) — PASS, 0 errors, 0 warnings, 0 section mismatches -------------------------------------------------------------------------------- multi_v7_defconfig (arm, gcc-10) — PASS, 0 errors, 0 warnings, 0 section mismatches -------------------------------------------------------------------------------- nommu_k210_defconfig (riscv, gcc-10) — PASS, 0 errors, 0 warnings, 0 section mismatches -------------------------------------------------------------------------------- nommu_k210_sdcard_defconfig (riscv, gcc-10) — PASS, 0 errors, 0 warnings, 0 section mismatches -------------------------------------------------------------------------------- omap2plus_defconfig (arm, gcc-10) — PASS, 0 errors, 0 warnings, 0 section mismatches -------------------------------------------------------------------------------- rv32_defconfig (riscv, gcc-10) — PASS, 0 errors, 0 warnings, 0 section mismatches -------------------------------------------------------------------------------- tinyconfig (i386, gcc-10) — PASS, 0 errors, 0 warnings, 0 section mismatches -------------------------------------------------------------------------------- tinyconfig (x86_64, gcc-10) — PASS, 0 errors, 0 warnings, 0 section mismatches -------------------------------------------------------------------------------- vexpress_defconfig (arm, gcc-10) — PASS, 0 errors, 0 warnings, 0 section mismatches -------------------------------------------------------------------------------- x86_64_defconfig (x86_64, gcc-10) — PASS, 0 errors, 0 warnings, 0 section mismatches -------------------------------------------------------------------------------- x86_64_defconfig+x86-board (x86_64, gcc-10) — PASS, 0 errors, 0 warnings, 0 section mismatches --- For more info write to <info(a)kernelci.org>
1 year, 4 months
1
0
0
0
stable-rc/linux-5.10.y build: 19 builds: 0 failed, 19 passed, 5 warnings (v5.10.201-188-g80dc4301c91e1)
by kernelci.org bot
stable-rc/linux-5.10.y build: 19 builds: 0 failed, 19 passed, 5 warnings (v5.10.201-188-g80dc4301c91e1) Full Build Summary:
https://kernelci.org/build/stable-rc/branch/linux-5.10.y/kernel/v5.10.201-1…
Tree: stable-rc Branch: linux-5.10.y Git Describe: v5.10.201-188-g80dc4301c91e1 Git Commit: 80dc4301c91e15c9c3cf12b393d70e0952bcd9ee Git URL:
https://git.kernel.org/pub/scm/linux/kernel/git/stable/linux-stable-rc.git
Built: 7 unique architectures Warnings Detected: arc: arm64: arm: i386: mips: 32r2el_defconfig (gcc-10): 1 warning riscv: rv32_defconfig (gcc-10): 4 warnings x86_64: Warnings summary: 2 <stdin>:830:2: warning: #warning syscall fstat64 not implemented [-Wcpp] 2 <stdin>:1127:2: warning: #warning syscall fstatat64 not implemented [-Wcpp] 1 WARNING: modpost: Symbol info of vmlinux is missing. Unresolved symbol check will be entirely skipped. ================================================================================ Detailed per-defconfig build reports: -------------------------------------------------------------------------------- 32r2el_defconfig (mips, gcc-10) — PASS, 0 errors, 1 warning, 0 section mismatches Warnings: WARNING: modpost: Symbol info of vmlinux is missing. Unresolved symbol check will be entirely skipped. -------------------------------------------------------------------------------- allnoconfig (i386, gcc-10) — PASS, 0 errors, 0 warnings, 0 section mismatches -------------------------------------------------------------------------------- allnoconfig (x86_64, gcc-10) — PASS, 0 errors, 0 warnings, 0 section mismatches -------------------------------------------------------------------------------- defconfig (riscv, gcc-10) — PASS, 0 errors, 0 warnings, 0 section mismatches -------------------------------------------------------------------------------- defconfig (arm64, gcc-10) — PASS, 0 errors, 0 warnings, 0 section mismatches -------------------------------------------------------------------------------- defconfig+arm64-chromebook (arm64, gcc-10) — PASS, 0 errors, 0 warnings, 0 section mismatches -------------------------------------------------------------------------------- haps_hs_smp_defconfig (arc, gcc-10) — PASS, 0 errors, 0 warnings, 0 section mismatches -------------------------------------------------------------------------------- i386_defconfig (i386, gcc-10) — PASS, 0 errors, 0 warnings, 0 section mismatches -------------------------------------------------------------------------------- imx_v6_v7_defconfig (arm, gcc-10) — PASS, 0 errors, 0 warnings, 0 section mismatches -------------------------------------------------------------------------------- multi_v5_defconfig (arm, gcc-10) — PASS, 0 errors, 0 warnings, 0 section mismatches -------------------------------------------------------------------------------- multi_v7_defconfig (arm, gcc-10) — PASS, 0 errors, 0 warnings, 0 section mismatches -------------------------------------------------------------------------------- nommu_k210_defconfig (riscv, gcc-10) — PASS, 0 errors, 0 warnings, 0 section mismatches -------------------------------------------------------------------------------- omap2plus_defconfig (arm, gcc-10) — PASS, 0 errors, 0 warnings, 0 section mismatches -------------------------------------------------------------------------------- rv32_defconfig (riscv, gcc-10) — PASS, 0 errors, 4 warnings, 0 section mismatches Warnings: <stdin>:830:2: warning: #warning syscall fstat64 not implemented [-Wcpp] <stdin>:1127:2: warning: #warning syscall fstatat64 not implemented [-Wcpp] <stdin>:830:2: warning: #warning syscall fstat64 not implemented [-Wcpp] <stdin>:1127:2: warning: #warning syscall fstatat64 not implemented [-Wcpp] -------------------------------------------------------------------------------- tinyconfig (i386, gcc-10) — PASS, 0 errors, 0 warnings, 0 section mismatches -------------------------------------------------------------------------------- tinyconfig (x86_64, gcc-10) — PASS, 0 errors, 0 warnings, 0 section mismatches -------------------------------------------------------------------------------- vexpress_defconfig (arm, gcc-10) — PASS, 0 errors, 0 warnings, 0 section mismatches -------------------------------------------------------------------------------- x86_64_defconfig (x86_64, gcc-10) — PASS, 0 errors, 0 warnings, 0 section mismatches -------------------------------------------------------------------------------- x86_64_defconfig+x86-board (x86_64, gcc-10) — PASS, 0 errors, 0 warnings, 0 section mismatches --- For more info write to <info(a)kernelci.org>
1 year, 4 months
1
0
0
0
stable-rc/queue/5.15 build: 20 builds: 0 failed, 20 passed, 3 warnings (v5.15.139-291-g3a968ce68298)
by kernelci.org bot
stable-rc/queue/5.15 build: 20 builds: 0 failed, 20 passed, 3 warnings (v5.15.139-291-g3a968ce68298) Full Build Summary:
https://kernelci.org/build/stable-rc/branch/queue%2F5.15/kernel/v5.15.139-2…
Tree: stable-rc Branch: queue/5.15 Git Describe: v5.15.139-291-g3a968ce68298 Git Commit: 3a968ce68298fe183d161da65c9b074dcf0b2a55 Git URL:
https://git.kernel.org/pub/scm/linux/kernel/git/stable/linux-stable-rc.git
Built: 7 unique architectures Warnings Detected: arm64: arm: i386: mips: 32r2el_defconfig (gcc-10): 1 warning riscv: x86_64: x86_64_defconfig (gcc-10): 1 warning x86_64_defconfig+x86-board (gcc-10): 1 warning Warnings summary: 2 arch/x86/kernel/smp.o: warning: objtool: sysvec_reboot()+0x45: unreachable instruction 1 arch/mips/boot/dts/img/boston.dts:128.19-178.5: Warning (pci_device_reg): /pci@14000000/pci2_root@0,0,0: PCI unit address format error, expected "0,0" ================================================================================ Detailed per-defconfig build reports: -------------------------------------------------------------------------------- 32r2el_defconfig (mips, gcc-10) — PASS, 0 errors, 1 warning, 0 section mismatches Warnings: arch/mips/boot/dts/img/boston.dts:128.19-178.5: Warning (pci_device_reg): /pci@14000000/pci2_root@0,0,0: PCI unit address format error, expected "0,0" -------------------------------------------------------------------------------- allnoconfig (i386, gcc-10) — PASS, 0 errors, 0 warnings, 0 section mismatches -------------------------------------------------------------------------------- allnoconfig (x86_64, gcc-10) — PASS, 0 errors, 0 warnings, 0 section mismatches -------------------------------------------------------------------------------- defconfig (riscv, gcc-10) — PASS, 0 errors, 0 warnings, 0 section mismatches -------------------------------------------------------------------------------- defconfig (arm64, gcc-10) — PASS, 0 errors, 0 warnings, 0 section mismatches -------------------------------------------------------------------------------- defconfig+arm64-chromebook (arm64, gcc-10) — PASS, 0 errors, 0 warnings, 0 section mismatches -------------------------------------------------------------------------------- i386_defconfig (i386, gcc-10) — PASS, 0 errors, 0 warnings, 0 section mismatches -------------------------------------------------------------------------------- imx_v6_v7_defconfig (arm, gcc-10) — PASS, 0 errors, 0 warnings, 0 section mismatches -------------------------------------------------------------------------------- multi_v5_defconfig (arm, gcc-10) — PASS, 0 errors, 0 warnings, 0 section mismatches -------------------------------------------------------------------------------- multi_v7_defconfig (arm, gcc-10) — PASS, 0 errors, 0 warnings, 0 section mismatches -------------------------------------------------------------------------------- nommu_k210_defconfig (riscv, gcc-10) — PASS, 0 errors, 0 warnings, 0 section mismatches -------------------------------------------------------------------------------- nommu_k210_sdcard_defconfig (riscv, gcc-10) — PASS, 0 errors, 0 warnings, 0 section mismatches -------------------------------------------------------------------------------- omap2plus_defconfig (arm, gcc-10) — PASS, 0 errors, 0 warnings, 0 section mismatches -------------------------------------------------------------------------------- tinyconfig (i386, gcc-10) — PASS, 0 errors, 0 warnings, 0 section mismatches -------------------------------------------------------------------------------- tinyconfig (x86_64, gcc-10) — PASS, 0 errors, 0 warnings, 0 section mismatches -------------------------------------------------------------------------------- vexpress_defconfig (arm, gcc-10) — PASS, 0 errors, 0 warnings, 0 section mismatches -------------------------------------------------------------------------------- x86_64_defconfig (x86_64, gcc-10) — PASS, 0 errors, 1 warning, 0 section mismatches Warnings: arch/x86/kernel/smp.o: warning: objtool: sysvec_reboot()+0x45: unreachable instruction -------------------------------------------------------------------------------- x86_64_defconfig+x86-board (x86_64, gcc-10) — PASS, 0 errors, 1 warning, 0 section mismatches Warnings: arch/x86/kernel/smp.o: warning: objtool: sysvec_reboot()+0x45: unreachable instruction --- For more info write to <info(a)kernelci.org>
1 year, 4 months
1
0
0
0
stable-rc/linux-5.4.y build: 17 builds: 0 failed, 17 passed, 26 warnings (v5.4.261-153-gc60c08fb3b15e)
by kernelci.org bot
stable-rc/linux-5.4.y build: 17 builds: 0 failed, 17 passed, 26 warnings (v5.4.261-153-gc60c08fb3b15e) Full Build Summary:
https://kernelci.org/build/stable-rc/branch/linux-5.4.y/kernel/v5.4.261-153…
Tree: stable-rc Branch: linux-5.4.y Git Describe: v5.4.261-153-gc60c08fb3b15e Git Commit: c60c08fb3b15e425fe832374d163ee93b97d2b0f Git URL:
https://git.kernel.org/pub/scm/linux/kernel/git/stable/linux-stable-rc.git
Built: 7 unique architectures Warnings Detected: arc: arm64: defconfig (gcc-10): 2 warnings defconfig+arm64-chromebook (gcc-10): 2 warnings arm: i386: allnoconfig (gcc-10): 2 warnings i386_defconfig (gcc-10): 2 warnings tinyconfig (gcc-10): 2 warnings mips: riscv: x86_64: allnoconfig (gcc-10): 4 warnings tinyconfig (gcc-10): 4 warnings x86_64_defconfig (gcc-10): 4 warnings x86_64_defconfig+x86-board (gcc-10): 4 warnings Warnings summary: 7 ld: warning: creating DT_TEXTREL in a PIE 4 ld: arch/x86/boot/compressed/head_64.o: warning: relocation in read-only section `.head.text' 4 arch/arm64/include/asm/memory.h:238:15: warning: cast from pointer to integer of different size [-Wpointer-to-int-cast] 3 ld: arch/x86/boot/compressed/head_32.o: warning: relocation in read-only section `.head.text' 2 arch/x86/entry/entry_64.o: warning: objtool: If this is a retpoline, please patch it in with alternatives and annotate it with ANNOTATE_NOSPEC_ALTERNATIVE. 2 arch/x86/entry/entry_64.o: warning: objtool: .entry.text+0x1c1: unsupported intra-function call 2 arch/x86/entry/entry_64.o: warning: objtool: .entry.text+0x151: unsupported intra-function call 2 arch/x86/entry/entry_64.S:1756: Warning: no instruction mnemonic suffix given and no register operands; using default for `sysret' Section mismatches summary: 1 WARNING: vmlinux.o(___ksymtab_gpl+vic_init_cascaded+0x0): Section mismatch in reference from the variable __ksymtab_vic_init_cascaded to the function .init.text:vic_init_cascaded() ================================================================================ Detailed per-defconfig build reports: -------------------------------------------------------------------------------- 32r2el_defconfig (mips, gcc-10) — PASS, 0 errors, 0 warnings, 0 section mismatches -------------------------------------------------------------------------------- allnoconfig (i386, gcc-10) — PASS, 0 errors, 2 warnings, 0 section mismatches Warnings: ld: arch/x86/boot/compressed/head_32.o: warning: relocation in read-only section `.head.text' ld: warning: creating DT_TEXTREL in a PIE -------------------------------------------------------------------------------- allnoconfig (x86_64, gcc-10) — PASS, 0 errors, 4 warnings, 0 section mismatches Warnings: arch/x86/entry/entry_64.S:1756: Warning: no instruction mnemonic suffix given and no register operands; using default for `sysret' arch/x86/entry/entry_64.o: warning: objtool: .entry.text+0x151: unsupported intra-function call ld: arch/x86/boot/compressed/head_64.o: warning: relocation in read-only section `.head.text' ld: warning: creating DT_TEXTREL in a PIE -------------------------------------------------------------------------------- defconfig (riscv, gcc-10) — PASS, 0 errors, 0 warnings, 0 section mismatches -------------------------------------------------------------------------------- defconfig (arm64, gcc-10) — PASS, 0 errors, 2 warnings, 0 section mismatches Warnings: arch/arm64/include/asm/memory.h:238:15: warning: cast from pointer to integer of different size [-Wpointer-to-int-cast] arch/arm64/include/asm/memory.h:238:15: warning: cast from pointer to integer of different size [-Wpointer-to-int-cast] -------------------------------------------------------------------------------- defconfig+arm64-chromebook (arm64, gcc-10) — PASS, 0 errors, 2 warnings, 0 section mismatches Warnings: arch/arm64/include/asm/memory.h:238:15: warning: cast from pointer to integer of different size [-Wpointer-to-int-cast] arch/arm64/include/asm/memory.h:238:15: warning: cast from pointer to integer of different size [-Wpointer-to-int-cast] -------------------------------------------------------------------------------- haps_hs_smp_defconfig (arc, gcc-10) — PASS, 0 errors, 0 warnings, 0 section mismatches -------------------------------------------------------------------------------- i386_defconfig (i386, gcc-10) — PASS, 0 errors, 2 warnings, 0 section mismatches Warnings: ld: arch/x86/boot/compressed/head_32.o: warning: relocation in read-only section `.head.text' ld: warning: creating DT_TEXTREL in a PIE -------------------------------------------------------------------------------- imx_v6_v7_defconfig (arm, gcc-10) — PASS, 0 errors, 0 warnings, 0 section mismatches -------------------------------------------------------------------------------- multi_v5_defconfig (arm, gcc-10) — PASS, 0 errors, 0 warnings, 0 section mismatches Section mismatches: WARNING: vmlinux.o(___ksymtab_gpl+vic_init_cascaded+0x0): Section mismatch in reference from the variable __ksymtab_vic_init_cascaded to the function .init.text:vic_init_cascaded() -------------------------------------------------------------------------------- multi_v7_defconfig (arm, gcc-10) — PASS, 0 errors, 0 warnings, 0 section mismatches -------------------------------------------------------------------------------- omap2plus_defconfig (arm, gcc-10) — PASS, 0 errors, 0 warnings, 0 section mismatches -------------------------------------------------------------------------------- tinyconfig (x86_64, gcc-10) — PASS, 0 errors, 4 warnings, 0 section mismatches Warnings: arch/x86/entry/entry_64.S:1756: Warning: no instruction mnemonic suffix given and no register operands; using default for `sysret' arch/x86/entry/entry_64.o: warning: objtool: .entry.text+0x151: unsupported intra-function call ld: arch/x86/boot/compressed/head_64.o: warning: relocation in read-only section `.head.text' ld: warning: creating DT_TEXTREL in a PIE -------------------------------------------------------------------------------- tinyconfig (i386, gcc-10) — PASS, 0 errors, 2 warnings, 0 section mismatches Warnings: ld: arch/x86/boot/compressed/head_32.o: warning: relocation in read-only section `.head.text' ld: warning: creating DT_TEXTREL in a PIE -------------------------------------------------------------------------------- vexpress_defconfig (arm, gcc-10) — PASS, 0 errors, 0 warnings, 0 section mismatches -------------------------------------------------------------------------------- x86_64_defconfig (x86_64, gcc-10) — PASS, 0 errors, 4 warnings, 0 section mismatches Warnings: arch/x86/entry/entry_64.o: warning: objtool: .entry.text+0x1c1: unsupported intra-function call arch/x86/entry/entry_64.o: warning: objtool: If this is a retpoline, please patch it in with alternatives and annotate it with ANNOTATE_NOSPEC_ALTERNATIVE. ld: arch/x86/boot/compressed/head_64.o: warning: relocation in read-only section `.head.text' ld: warning: creating DT_TEXTREL in a PIE -------------------------------------------------------------------------------- x86_64_defconfig+x86-board (x86_64, gcc-10) — PASS, 0 errors, 4 warnings, 0 section mismatches Warnings: arch/x86/entry/entry_64.o: warning: objtool: .entry.text+0x1c1: unsupported intra-function call arch/x86/entry/entry_64.o: warning: objtool: If this is a retpoline, please patch it in with alternatives and annotate it with ANNOTATE_NOSPEC_ALTERNATIVE. ld: arch/x86/boot/compressed/head_64.o: warning: relocation in read-only section `.head.text' ld: warning: creating DT_TEXTREL in a PIE --- For more info write to <info(a)kernelci.org>
1 year, 4 months
1
0
0
0
stable-rc/queue/5.4 build: 17 builds: 0 failed, 17 passed, 26 warnings (v5.4.261-152-g6e0f766fc073)
by kernelci.org bot
stable-rc/queue/5.4 build: 17 builds: 0 failed, 17 passed, 26 warnings (v5.4.261-152-g6e0f766fc073) Full Build Summary:
https://kernelci.org/build/stable-rc/branch/queue%2F5.4/kernel/v5.4.261-152…
Tree: stable-rc Branch: queue/5.4 Git Describe: v5.4.261-152-g6e0f766fc073 Git Commit: 6e0f766fc07353ea748fea4b1fe2ea9c0a2f59f2 Git URL:
https://git.kernel.org/pub/scm/linux/kernel/git/stable/linux-stable-rc.git
Built: 7 unique architectures Warnings Detected: arc: arm64: defconfig (gcc-10): 2 warnings defconfig+arm64-chromebook (gcc-10): 2 warnings arm: i386: allnoconfig (gcc-10): 2 warnings i386_defconfig (gcc-10): 2 warnings tinyconfig (gcc-10): 2 warnings mips: riscv: x86_64: allnoconfig (gcc-10): 4 warnings tinyconfig (gcc-10): 4 warnings x86_64_defconfig (gcc-10): 4 warnings x86_64_defconfig+x86-board (gcc-10): 4 warnings Warnings summary: 7 ld: warning: creating DT_TEXTREL in a PIE 4 ld: arch/x86/boot/compressed/head_64.o: warning: relocation in read-only section `.head.text' 4 arch/arm64/include/asm/memory.h:238:15: warning: cast from pointer to integer of different size [-Wpointer-to-int-cast] 3 ld: arch/x86/boot/compressed/head_32.o: warning: relocation in read-only section `.head.text' 2 arch/x86/entry/entry_64.o: warning: objtool: If this is a retpoline, please patch it in with alternatives and annotate it with ANNOTATE_NOSPEC_ALTERNATIVE. 2 arch/x86/entry/entry_64.o: warning: objtool: .entry.text+0x1c1: unsupported intra-function call 2 arch/x86/entry/entry_64.o: warning: objtool: .entry.text+0x151: unsupported intra-function call 2 arch/x86/entry/entry_64.S:1756: Warning: no instruction mnemonic suffix given and no register operands; using default for `sysret' Section mismatches summary: 1 WARNING: vmlinux.o(___ksymtab_gpl+vic_init_cascaded+0x0): Section mismatch in reference from the variable __ksymtab_vic_init_cascaded to the function .init.text:vic_init_cascaded() ================================================================================ Detailed per-defconfig build reports: -------------------------------------------------------------------------------- 32r2el_defconfig (mips, gcc-10) — PASS, 0 errors, 0 warnings, 0 section mismatches -------------------------------------------------------------------------------- allnoconfig (x86_64, gcc-10) — PASS, 0 errors, 4 warnings, 0 section mismatches Warnings: arch/x86/entry/entry_64.S:1756: Warning: no instruction mnemonic suffix given and no register operands; using default for `sysret' arch/x86/entry/entry_64.o: warning: objtool: .entry.text+0x151: unsupported intra-function call ld: arch/x86/boot/compressed/head_64.o: warning: relocation in read-only section `.head.text' ld: warning: creating DT_TEXTREL in a PIE -------------------------------------------------------------------------------- allnoconfig (i386, gcc-10) — PASS, 0 errors, 2 warnings, 0 section mismatches Warnings: ld: arch/x86/boot/compressed/head_32.o: warning: relocation in read-only section `.head.text' ld: warning: creating DT_TEXTREL in a PIE -------------------------------------------------------------------------------- defconfig (riscv, gcc-10) — PASS, 0 errors, 0 warnings, 0 section mismatches -------------------------------------------------------------------------------- defconfig (arm64, gcc-10) — PASS, 0 errors, 2 warnings, 0 section mismatches Warnings: arch/arm64/include/asm/memory.h:238:15: warning: cast from pointer to integer of different size [-Wpointer-to-int-cast] arch/arm64/include/asm/memory.h:238:15: warning: cast from pointer to integer of different size [-Wpointer-to-int-cast] -------------------------------------------------------------------------------- defconfig+arm64-chromebook (arm64, gcc-10) — PASS, 0 errors, 2 warnings, 0 section mismatches Warnings: arch/arm64/include/asm/memory.h:238:15: warning: cast from pointer to integer of different size [-Wpointer-to-int-cast] arch/arm64/include/asm/memory.h:238:15: warning: cast from pointer to integer of different size [-Wpointer-to-int-cast] -------------------------------------------------------------------------------- haps_hs_smp_defconfig (arc, gcc-10) — PASS, 0 errors, 0 warnings, 0 section mismatches -------------------------------------------------------------------------------- i386_defconfig (i386, gcc-10) — PASS, 0 errors, 2 warnings, 0 section mismatches Warnings: ld: arch/x86/boot/compressed/head_32.o: warning: relocation in read-only section `.head.text' ld: warning: creating DT_TEXTREL in a PIE -------------------------------------------------------------------------------- imx_v6_v7_defconfig (arm, gcc-10) — PASS, 0 errors, 0 warnings, 0 section mismatches -------------------------------------------------------------------------------- multi_v5_defconfig (arm, gcc-10) — PASS, 0 errors, 0 warnings, 0 section mismatches Section mismatches: WARNING: vmlinux.o(___ksymtab_gpl+vic_init_cascaded+0x0): Section mismatch in reference from the variable __ksymtab_vic_init_cascaded to the function .init.text:vic_init_cascaded() -------------------------------------------------------------------------------- multi_v7_defconfig (arm, gcc-10) — PASS, 0 errors, 0 warnings, 0 section mismatches -------------------------------------------------------------------------------- omap2plus_defconfig (arm, gcc-10) — PASS, 0 errors, 0 warnings, 0 section mismatches -------------------------------------------------------------------------------- tinyconfig (i386, gcc-10) — PASS, 0 errors, 2 warnings, 0 section mismatches Warnings: ld: arch/x86/boot/compressed/head_32.o: warning: relocation in read-only section `.head.text' ld: warning: creating DT_TEXTREL in a PIE -------------------------------------------------------------------------------- tinyconfig (x86_64, gcc-10) — PASS, 0 errors, 4 warnings, 0 section mismatches Warnings: arch/x86/entry/entry_64.S:1756: Warning: no instruction mnemonic suffix given and no register operands; using default for `sysret' arch/x86/entry/entry_64.o: warning: objtool: .entry.text+0x151: unsupported intra-function call ld: arch/x86/boot/compressed/head_64.o: warning: relocation in read-only section `.head.text' ld: warning: creating DT_TEXTREL in a PIE -------------------------------------------------------------------------------- vexpress_defconfig (arm, gcc-10) — PASS, 0 errors, 0 warnings, 0 section mismatches -------------------------------------------------------------------------------- x86_64_defconfig (x86_64, gcc-10) — PASS, 0 errors, 4 warnings, 0 section mismatches Warnings: arch/x86/entry/entry_64.o: warning: objtool: .entry.text+0x1c1: unsupported intra-function call arch/x86/entry/entry_64.o: warning: objtool: If this is a retpoline, please patch it in with alternatives and annotate it with ANNOTATE_NOSPEC_ALTERNATIVE. ld: arch/x86/boot/compressed/head_64.o: warning: relocation in read-only section `.head.text' ld: warning: creating DT_TEXTREL in a PIE -------------------------------------------------------------------------------- x86_64_defconfig+x86-board (x86_64, gcc-10) — PASS, 0 errors, 4 warnings, 0 section mismatches Warnings: arch/x86/entry/entry_64.o: warning: objtool: .entry.text+0x1c1: unsupported intra-function call arch/x86/entry/entry_64.o: warning: objtool: If this is a retpoline, please patch it in with alternatives and annotate it with ANNOTATE_NOSPEC_ALTERNATIVE. ld: arch/x86/boot/compressed/head_64.o: warning: relocation in read-only section `.head.text' ld: warning: creating DT_TEXTREL in a PIE --- For more info write to <info(a)kernelci.org>
1 year, 4 months
1
0
0
0
stable-rc/linux-6.1.y build: 20 builds: 0 failed, 20 passed, 1 warning (v6.1.63-368-g60c4064a8298e)
by kernelci.org bot
stable-rc/linux-6.1.y build: 20 builds: 0 failed, 20 passed, 1 warning (v6.1.63-368-g60c4064a8298e) Full Build Summary:
https://kernelci.org/build/stable-rc/branch/linux-6.1.y/kernel/v6.1.63-368-…
Tree: stable-rc Branch: linux-6.1.y Git Describe: v6.1.63-368-g60c4064a8298e Git Commit: 60c4064a8298ea9ea75155062f554d2097d8b5e6 Git URL:
https://git.kernel.org/pub/scm/linux/kernel/git/stable/linux-stable-rc.git
Built: 7 unique architectures Warnings Detected: arc: arm64: arm: i386: mips: 32r2el_defconfig (gcc-10): 1 warning riscv: x86_64: Warnings summary: 1 arch/mips/boot/dts/img/boston.dts:128.19-178.5: Warning (pci_device_reg): /pci@14000000/pci2_root@0,0,0: PCI unit address format error, expected "0,0" ================================================================================ Detailed per-defconfig build reports: -------------------------------------------------------------------------------- 32r2el_defconfig (mips, gcc-10) — PASS, 0 errors, 1 warning, 0 section mismatches Warnings: arch/mips/boot/dts/img/boston.dts:128.19-178.5: Warning (pci_device_reg): /pci@14000000/pci2_root@0,0,0: PCI unit address format error, expected "0,0" -------------------------------------------------------------------------------- allnoconfig (i386, gcc-10) — PASS, 0 errors, 0 warnings, 0 section mismatches -------------------------------------------------------------------------------- allnoconfig (x86_64, gcc-10) — PASS, 0 errors, 0 warnings, 0 section mismatches -------------------------------------------------------------------------------- defconfig (riscv, gcc-10) — PASS, 0 errors, 0 warnings, 0 section mismatches -------------------------------------------------------------------------------- defconfig (arm64, gcc-10) — PASS, 0 errors, 0 warnings, 0 section mismatches -------------------------------------------------------------------------------- defconfig+arm64-chromebook (arm64, gcc-10) — PASS, 0 errors, 0 warnings, 0 section mismatches -------------------------------------------------------------------------------- haps_hs_smp_defconfig (arc, gcc-10) — PASS, 0 errors, 0 warnings, 0 section mismatches -------------------------------------------------------------------------------- i386_defconfig (i386, gcc-10) — PASS, 0 errors, 0 warnings, 0 section mismatches -------------------------------------------------------------------------------- imx_v6_v7_defconfig (arm, gcc-10) — PASS, 0 errors, 0 warnings, 0 section mismatches -------------------------------------------------------------------------------- multi_v5_defconfig (arm, gcc-10) — PASS, 0 errors, 0 warnings, 0 section mismatches -------------------------------------------------------------------------------- multi_v7_defconfig (arm, gcc-10) — PASS, 0 errors, 0 warnings, 0 section mismatches -------------------------------------------------------------------------------- nommu_k210_defconfig (riscv, gcc-10) — PASS, 0 errors, 0 warnings, 0 section mismatches -------------------------------------------------------------------------------- nommu_k210_sdcard_defconfig (riscv, gcc-10) — PASS, 0 errors, 0 warnings, 0 section mismatches -------------------------------------------------------------------------------- omap2plus_defconfig (arm, gcc-10) — PASS, 0 errors, 0 warnings, 0 section mismatches -------------------------------------------------------------------------------- rv32_defconfig (riscv, gcc-10) — PASS, 0 errors, 0 warnings, 0 section mismatches -------------------------------------------------------------------------------- tinyconfig (i386, gcc-10) — PASS, 0 errors, 0 warnings, 0 section mismatches -------------------------------------------------------------------------------- tinyconfig (x86_64, gcc-10) — PASS, 0 errors, 0 warnings, 0 section mismatches -------------------------------------------------------------------------------- vexpress_defconfig (arm, gcc-10) — PASS, 0 errors, 0 warnings, 0 section mismatches -------------------------------------------------------------------------------- x86_64_defconfig (x86_64, gcc-10) — PASS, 0 errors, 0 warnings, 0 section mismatches -------------------------------------------------------------------------------- x86_64_defconfig+x86-board (x86_64, gcc-10) — PASS, 0 errors, 0 warnings, 0 section mismatches --- For more info write to <info(a)kernelci.org>
1 year, 4 months
1
0
0
0
stable-rc/linux-4.14.y build: 16 builds: 0 failed, 16 passed, 21 warnings (v4.14.330-54-g0957336c00be)
by kernelci.org bot
stable-rc/linux-4.14.y build: 16 builds: 0 failed, 16 passed, 21 warnings (v4.14.330-54-g0957336c00be) Full Build Summary:
https://kernelci.org/build/stable-rc/branch/linux-4.14.y/kernel/v4.14.330-5…
Tree: stable-rc Branch: linux-4.14.y Git Describe: v4.14.330-54-g0957336c00be Git Commit: 0957336c00bea3193c550b28144cbadfbbbc411f Git URL:
https://git.kernel.org/pub/scm/linux/kernel/git/stable/linux-stable-rc.git
Built: 6 unique architectures Warnings Detected: arc: arm64: arm: i386: allnoconfig (gcc-10): 3 warnings i386_defconfig (gcc-10): 3 warnings tinyconfig (gcc-10): 3 warnings mips: x86_64: allnoconfig (gcc-10): 3 warnings tinyconfig (gcc-10): 3 warnings x86_64_defconfig (gcc-10): 3 warnings x86_64_defconfig+x86-board (gcc-10): 3 warnings Warnings summary: 7 ld: warning: creating DT_TEXTREL in a PIE 4 ld: arch/x86/boot/compressed/head_64.o: warning: relocation in read-only section `.head.text' 4 Warning: synced file at 'tools/objtool/arch/x86/include/asm/insn.h' differs from latest kernel version at 'arch/x86/include/asm/insn.h' 3 ld: arch/x86/boot/compressed/head_32.o: warning: relocation in read-only section `.head.text' 3 arch/x86/entry/entry_32.S:480: Warning: no instruction mnemonic suffix given and no register operands; using default for `btr' Section mismatches summary: 3 WARNING: modpost: Found 1 section mismatch(es). ================================================================================ Detailed per-defconfig build reports: -------------------------------------------------------------------------------- 32r2el_defconfig (mips, gcc-10) — PASS, 0 errors, 0 warnings, 0 section mismatches -------------------------------------------------------------------------------- allnoconfig (i386, gcc-10) — PASS, 0 errors, 3 warnings, 0 section mismatches Warnings: arch/x86/entry/entry_32.S:480: Warning: no instruction mnemonic suffix given and no register operands; using default for `btr' ld: arch/x86/boot/compressed/head_32.o: warning: relocation in read-only section `.head.text' ld: warning: creating DT_TEXTREL in a PIE -------------------------------------------------------------------------------- allnoconfig (x86_64, gcc-10) — PASS, 0 errors, 3 warnings, 0 section mismatches Warnings: Warning: synced file at 'tools/objtool/arch/x86/include/asm/insn.h' differs from latest kernel version at 'arch/x86/include/asm/insn.h' ld: arch/x86/boot/compressed/head_64.o: warning: relocation in read-only section `.head.text' ld: warning: creating DT_TEXTREL in a PIE -------------------------------------------------------------------------------- defconfig (arm64, gcc-10) — PASS, 0 errors, 0 warnings, 0 section mismatches Section mismatches: WARNING: modpost: Found 1 section mismatch(es). -------------------------------------------------------------------------------- defconfig+arm64-chromebook (arm64, gcc-10) — PASS, 0 errors, 0 warnings, 0 section mismatches Section mismatches: WARNING: modpost: Found 1 section mismatch(es). -------------------------------------------------------------------------------- haps_hs_smp_defconfig (arc, gcc-10) — PASS, 0 errors, 0 warnings, 0 section mismatches -------------------------------------------------------------------------------- i386_defconfig (i386, gcc-10) — PASS, 0 errors, 3 warnings, 0 section mismatches Warnings: arch/x86/entry/entry_32.S:480: Warning: no instruction mnemonic suffix given and no register operands; using default for `btr' ld: arch/x86/boot/compressed/head_32.o: warning: relocation in read-only section `.head.text' ld: warning: creating DT_TEXTREL in a PIE -------------------------------------------------------------------------------- imx_v6_v7_defconfig (arm, gcc-10) — PASS, 0 errors, 0 warnings, 0 section mismatches -------------------------------------------------------------------------------- multi_v5_defconfig (arm, gcc-10) — PASS, 0 errors, 0 warnings, 0 section mismatches Section mismatches: WARNING: modpost: Found 1 section mismatch(es). -------------------------------------------------------------------------------- multi_v7_defconfig (arm, gcc-10) — PASS, 0 errors, 0 warnings, 0 section mismatches -------------------------------------------------------------------------------- omap2plus_defconfig (arm, gcc-10) — PASS, 0 errors, 0 warnings, 0 section mismatches -------------------------------------------------------------------------------- tinyconfig (i386, gcc-10) — PASS, 0 errors, 3 warnings, 0 section mismatches Warnings: arch/x86/entry/entry_32.S:480: Warning: no instruction mnemonic suffix given and no register operands; using default for `btr' ld: arch/x86/boot/compressed/head_32.o: warning: relocation in read-only section `.head.text' ld: warning: creating DT_TEXTREL in a PIE -------------------------------------------------------------------------------- tinyconfig (x86_64, gcc-10) — PASS, 0 errors, 3 warnings, 0 section mismatches Warnings: Warning: synced file at 'tools/objtool/arch/x86/include/asm/insn.h' differs from latest kernel version at 'arch/x86/include/asm/insn.h' ld: arch/x86/boot/compressed/head_64.o: warning: relocation in read-only section `.head.text' ld: warning: creating DT_TEXTREL in a PIE -------------------------------------------------------------------------------- vexpress_defconfig (arm, gcc-10) — PASS, 0 errors, 0 warnings, 0 section mismatches -------------------------------------------------------------------------------- x86_64_defconfig (x86_64, gcc-10) — PASS, 0 errors, 3 warnings, 0 section mismatches Warnings: Warning: synced file at 'tools/objtool/arch/x86/include/asm/insn.h' differs from latest kernel version at 'arch/x86/include/asm/insn.h' ld: arch/x86/boot/compressed/head_64.o: warning: relocation in read-only section `.head.text' ld: warning: creating DT_TEXTREL in a PIE -------------------------------------------------------------------------------- x86_64_defconfig+x86-board (x86_64, gcc-10) — PASS, 0 errors, 3 warnings, 0 section mismatches Warnings: Warning: synced file at 'tools/objtool/arch/x86/include/asm/insn.h' differs from latest kernel version at 'arch/x86/include/asm/insn.h' ld: arch/x86/boot/compressed/head_64.o: warning: relocation in read-only section `.head.text' ld: warning: creating DT_TEXTREL in a PIE --- For more info write to <info(a)kernelci.org>
1 year, 4 months
1
0
0
0
stable-rc/queue/4.19 build: 19 builds: 3 failed, 16 passed, 20 warnings (v4.19.299-92-gf257a2fe7b9e)
by kernelci.org bot
stable-rc/queue/4.19 build: 19 builds: 3 failed, 16 passed, 20 warnings (v4.19.299-92-gf257a2fe7b9e) Full Build Summary:
https://kernelci.org/build/stable-rc/branch/queue%2F4.19/kernel/v4.19.299-9…
Tree: stable-rc Branch: queue/4.19 Git Describe: v4.19.299-92-gf257a2fe7b9e Git Commit: f257a2fe7b9ef933eb47340616ba2d4a5002648c Git URL:
https://git.kernel.org/pub/scm/linux/kernel/git/stable/linux-stable-rc.git
Built: 7 unique architectures Build Failures Detected: riscv: allnoconfig: (gcc-10) FAIL defconfig: (gcc-10) FAIL tinyconfig: (gcc-10) FAIL Warnings Detected: arc: arm64: defconfig (gcc-10): 3 warnings defconfig+arm64-chromebook (gcc-10): 3 warnings arm: i386: allnoconfig (gcc-10): 2 warnings i386_defconfig (gcc-10): 2 warnings tinyconfig (gcc-10): 2 warnings mips: riscv: x86_64: allnoconfig (gcc-10): 2 warnings tinyconfig (gcc-10): 2 warnings x86_64_defconfig (gcc-10): 2 warnings x86_64_defconfig+x86-board (gcc-10): 2 warnings Warnings summary: 7 ld: warning: creating DT_TEXTREL in a PIE 6 aarch64-linux-gnu-ld: warning: -z norelro ignored 4 ld: arch/x86/boot/compressed/head_64.o: warning: relocation in read-only section `.head.text' 3 ld: arch/x86/boot/compressed/head_32.o: warning: relocation in read-only section `.head.text' Section mismatches summary: 4 WARNING: modpost: Found 1 section mismatch(es). ================================================================================ Detailed per-defconfig build reports: -------------------------------------------------------------------------------- 32r2el_defconfig (mips, gcc-10) — PASS, 0 errors, 0 warnings, 0 section mismatches -------------------------------------------------------------------------------- allnoconfig (i386, gcc-10) — PASS, 0 errors, 2 warnings, 0 section mismatches Warnings: ld: arch/x86/boot/compressed/head_32.o: warning: relocation in read-only section `.head.text' ld: warning: creating DT_TEXTREL in a PIE -------------------------------------------------------------------------------- allnoconfig (x86_64, gcc-10) — PASS, 0 errors, 2 warnings, 0 section mismatches Warnings: ld: arch/x86/boot/compressed/head_64.o: warning: relocation in read-only section `.head.text' ld: warning: creating DT_TEXTREL in a PIE -------------------------------------------------------------------------------- allnoconfig (riscv, gcc-10) — FAIL, 0 errors, 0 warnings, 0 section mismatches -------------------------------------------------------------------------------- defconfig (riscv, gcc-10) — FAIL, 0 errors, 0 warnings, 0 section mismatches -------------------------------------------------------------------------------- defconfig (arm64, gcc-10) — PASS, 0 errors, 3 warnings, 0 section mismatches Warnings: aarch64-linux-gnu-ld: warning: -z norelro ignored aarch64-linux-gnu-ld: warning: -z norelro ignored aarch64-linux-gnu-ld: warning: -z norelro ignored Section mismatches: WARNING: modpost: Found 1 section mismatch(es). -------------------------------------------------------------------------------- defconfig+arm64-chromebook (arm64, gcc-10) — PASS, 0 errors, 3 warnings, 0 section mismatches Warnings: aarch64-linux-gnu-ld: warning: -z norelro ignored aarch64-linux-gnu-ld: warning: -z norelro ignored aarch64-linux-gnu-ld: warning: -z norelro ignored Section mismatches: WARNING: modpost: Found 1 section mismatch(es). -------------------------------------------------------------------------------- haps_hs_smp_defconfig (arc, gcc-10) — PASS, 0 errors, 0 warnings, 0 section mismatches -------------------------------------------------------------------------------- i386_defconfig (i386, gcc-10) — PASS, 0 errors, 2 warnings, 0 section mismatches Warnings: ld: arch/x86/boot/compressed/head_32.o: warning: relocation in read-only section `.head.text' ld: warning: creating DT_TEXTREL in a PIE -------------------------------------------------------------------------------- imx_v6_v7_defconfig (arm, gcc-10) — PASS, 0 errors, 0 warnings, 0 section mismatches -------------------------------------------------------------------------------- multi_v5_defconfig (arm, gcc-10) — PASS, 0 errors, 0 warnings, 0 section mismatches Section mismatches: WARNING: modpost: Found 1 section mismatch(es). -------------------------------------------------------------------------------- multi_v7_defconfig (arm, gcc-10) — PASS, 0 errors, 0 warnings, 0 section mismatches Section mismatches: WARNING: modpost: Found 1 section mismatch(es). -------------------------------------------------------------------------------- omap2plus_defconfig (arm, gcc-10) — PASS, 0 errors, 0 warnings, 0 section mismatches -------------------------------------------------------------------------------- tinyconfig (x86_64, gcc-10) — PASS, 0 errors, 2 warnings, 0 section mismatches Warnings: ld: arch/x86/boot/compressed/head_64.o: warning: relocation in read-only section `.head.text' ld: warning: creating DT_TEXTREL in a PIE -------------------------------------------------------------------------------- tinyconfig (riscv, gcc-10) — FAIL, 0 errors, 0 warnings, 0 section mismatches -------------------------------------------------------------------------------- tinyconfig (i386, gcc-10) — PASS, 0 errors, 2 warnings, 0 section mismatches Warnings: ld: arch/x86/boot/compressed/head_32.o: warning: relocation in read-only section `.head.text' ld: warning: creating DT_TEXTREL in a PIE -------------------------------------------------------------------------------- vexpress_defconfig (arm, gcc-10) — PASS, 0 errors, 0 warnings, 0 section mismatches -------------------------------------------------------------------------------- x86_64_defconfig (x86_64, gcc-10) — PASS, 0 errors, 2 warnings, 0 section mismatches Warnings: ld: arch/x86/boot/compressed/head_64.o: warning: relocation in read-only section `.head.text' ld: warning: creating DT_TEXTREL in a PIE -------------------------------------------------------------------------------- x86_64_defconfig+x86-board (x86_64, gcc-10) — PASS, 0 errors, 2 warnings, 0 section mismatches Warnings: ld: arch/x86/boot/compressed/head_64.o: warning: relocation in read-only section `.head.text' ld: warning: creating DT_TEXTREL in a PIE --- For more info write to <info(a)kernelci.org>
1 year, 4 months
1
0
0
0
mainline/master baseline: 376 runs, 13 regressions (v6.7-rc3)
by kernelci.org bot
mainline/master baseline: 376 runs, 13 regressions (v6.7-rc3) Regressions Summary ------------------- platform | arch | lab | compiler | defconfig | regressions -----------------------------+-------+---------------+----------+------------------------------+------------ at91sam9g20ek | arm | lab-broonie | clang-16 | multi_v5_defconfig | 1 bcm2836-rpi-2-b | arm | lab-collabora | gcc-10 | bcm2835_defconfig | 1 bcm2836-rpi-2-b | arm | lab-collabora | gcc-10 | multi_v7_defc...MB2_KERNEL=y | 1 imx6ul-14x14-evk | arm | lab-nxp | gcc-10 | imx_v6_v7_defconfig | 1 imx7d-sdb | arm | lab-nxp | gcc-10 | imx_v6_v7_defconfig | 1 r8a774c0-ek874 | arm64 | lab-cip | gcc-10 | defconfig+videodec | 1 rk3399-rock-pi-4b | arm64 | lab-collabora | gcc-10 | defconfig+videodec | 1 sun7i-a20-cubieboard2 | arm | lab-clabbe | gcc-10 | multi_v7_defconfig | 1 sun7i-a20-cubieboard2 | arm | lab-clabbe | gcc-10 | multi_v7_defc...MB2_KERNEL=y | 1 sun7i-a20-cubieboard2 | arm | lab-clabbe | gcc-10 | multi_v7_defc...CONFIG_SMP=n | 1 sun8i-h2-plus...ch-all-h3-cc | arm | lab-baylibre | gcc-10 | sunxi_defconfig | 1 sun8i-h2-plus-orangepi-zero | arm | lab-baylibre | gcc-10 | sunxi_defconfig | 1 zynqmp-zcu102 | arm64 | lab-cip | gcc-10 | defconfig+debug | 1 Details:
https://kernelci.org/test/job/mainline/branch/master/kernel/v6.7-rc3/plan/b…
Test: baseline Tree: mainline Branch: master Describe: v6.7-rc3 URL:
https://git.kernel.org/pub/scm/linux/kernel/git/torvalds/linux.git
SHA: 2cc14f52aeb78ce3f29677c2de1f06c0e91471ab Test Regressions ---------------- platform | arch | lab | compiler | defconfig | regressions -----------------------------+-------+---------------+----------+------------------------------+------------ at91sam9g20ek | arm | lab-broonie | clang-16 | multi_v5_defconfig | 1 Details:
https://kernelci.org/test/plan/id/65642dbb810dc6c32f7e4aa2
Results: 52 PASS, 2 FAIL, 1 SKIP Full config: multi_v5_defconfig Compiler: clang-16 (Debian clang version 16.0.6 (++20231112100453+7cbf1a259152-1~exp1~20231112100542.106)) Plain log:
https://storage.kernelci.org//mainline/master/v6.7-rc3/arm/multi_v5_defconf…
HTML log:
https://storage.kernelci.org//mainline/master/v6.7-rc3/arm/multi_v5_defconf…
Rootfs:
http://storage.kernelci.org/images/rootfs/buildroot/buildroot-baseline/2023…
* baseline.bootrr.atmel-ramc-driver-present:
https://kernelci.org/test/case/id/65642dbb810dc6c32f7e4ac1
failing since 13 days (last pass: v6.4-7208-gc6b0271053e7a, first fail: v6.7-rc1-12-g9bacdd8996c7) 2023-11-27T05:48:16.446959 /lava-277029/1/../bin/lava-test-case 2023-11-27T05:48:16.489524 <8><LAVA_SIGNAL_TESTCASE TEST_CASE_ID=atmel-ramc-driver-present RESULT=fail> platform | arch | lab | compiler | defconfig | regressions -----------------------------+-------+---------------+----------+------------------------------+------------ bcm2836-rpi-2-b | arm | lab-collabora | gcc-10 | bcm2835_defconfig | 1 Details:
https://kernelci.org/test/plan/id/65642816ca6c893d447e4a80
Results: 0 PASS, 1 FAIL, 0 SKIP Full config: bcm2835_defconfig Compiler: gcc-10 (arm-linux-gnueabihf-gcc (Debian 10.2.1-6) 10.2.1 20210110) Plain log:
https://storage.kernelci.org//mainline/master/v6.7-rc3/arm/bcm2835_defconfi…
HTML log:
https://storage.kernelci.org//mainline/master/v6.7-rc3/arm/bcm2835_defconfi…
Rootfs:
http://storage.kernelci.org/images/rootfs/buildroot/buildroot-baseline/2023…
* baseline.login:
https://kernelci.org/test/case/id/65642816ca6c893d447e4a81
failing since 13 days (last pass: v6.4-7208-gc6b0271053e7a, first fail: v6.7-rc1-12-g9bacdd8996c7) platform | arch | lab | compiler | defconfig | regressions -----------------------------+-------+---------------+----------+------------------------------+------------ bcm2836-rpi-2-b | arm | lab-collabora | gcc-10 | multi_v7_defc...MB2_KERNEL=y | 1 Details:
https://kernelci.org/test/plan/id/65642c4f9902802cd27e4a72
Results: 0 PASS, 1 FAIL, 0 SKIP Full config: multi_v7_defconfig+CONFIG_THUMB2_KERNEL=y Compiler: gcc-10 (arm-linux-gnueabihf-gcc (Debian 10.2.1-6) 10.2.1 20210110) Plain log:
https://storage.kernelci.org//mainline/master/v6.7-rc3/arm/multi_v7_defconf…
HTML log:
https://storage.kernelci.org//mainline/master/v6.7-rc3/arm/multi_v7_defconf…
Rootfs:
http://storage.kernelci.org/images/rootfs/buildroot/buildroot-baseline/2023…
* baseline.login:
https://kernelci.org/test/case/id/65642c4f9902802cd27e4a73
failing since 274 days (last pass: v6.2-10827-g489fa31ea873, first fail: v6.2-11606-g116b41162f8b) platform | arch | lab | compiler | defconfig | regressions -----------------------------+-------+---------------+----------+------------------------------+------------ imx6ul-14x14-evk | arm | lab-nxp | gcc-10 | imx_v6_v7_defconfig | 1 Details:
https://kernelci.org/test/plan/id/65642f968b95b587147e4a6d
Results: 5 PASS, 1 FAIL, 1 SKIP Full config: imx_v6_v7_defconfig Compiler: gcc-10 (arm-linux-gnueabihf-gcc (Debian 10.2.1-6) 10.2.1 20210110) Plain log:
https://storage.kernelci.org//mainline/master/v6.7-rc3/arm/imx_v6_v7_defcon…
HTML log:
https://storage.kernelci.org//mainline/master/v6.7-rc3/arm/imx_v6_v7_defcon…
Rootfs:
http://storage.kernelci.org/images/rootfs/buildroot/buildroot-baseline/2023…
* baseline.bootrr.deferred-probe-empty:
https://kernelci.org/test/case/id/65642f968b95b587147e4a74
failing since 13 days (last pass: v6.3-12423-g865fdb08197e, first fail: v6.7-rc1-12-g9bacdd8996c7) 2023-11-27T05:56:24.867726 + set +x 2023-11-27T05:56:24.870454 <8>[ 19.460057] <LAVA_SIGNAL_ENDRUN 0_dmesg 1260671_1.5.2.4.1> 2023-11-27T05:56:24.979228 / # # 2023-11-27T05:56:26.135210 export SHELL=/bin/sh 2023-11-27T05:56:26.140848 # 2023-11-27T05:56:27.682968 / # export SHELL=/bin/sh. /lava-1260671/environment 2023-11-27T05:56:27.688622 2023-11-27T05:56:30.500860 / # . /lava-1260671/environment/lava-1260671/bin/lava-test-runner /lava-1260671/1 2023-11-27T05:56:30.506852 2023-11-27T05:56:30.509427 / # /lava-1260671/bin/lava-test-runner /lava-1260671/1 ... (12 line(s) more) platform | arch | lab | compiler | defconfig | regressions -----------------------------+-------+---------------+----------+------------------------------+------------ imx7d-sdb | arm | lab-nxp | gcc-10 | imx_v6_v7_defconfig | 1 Details:
https://kernelci.org/test/plan/id/65642faa8b95b587147e4a92
Results: 5 PASS, 1 FAIL, 1 SKIP Full config: imx_v6_v7_defconfig Compiler: gcc-10 (arm-linux-gnueabihf-gcc (Debian 10.2.1-6) 10.2.1 20210110) Plain log:
https://storage.kernelci.org//mainline/master/v6.7-rc3/arm/imx_v6_v7_defcon…
HTML log:
https://storage.kernelci.org//mainline/master/v6.7-rc3/arm/imx_v6_v7_defcon…
Rootfs:
http://storage.kernelci.org/images/rootfs/buildroot/buildroot-baseline/2023…
* baseline.bootrr.deferred-probe-empty:
https://kernelci.org/test/case/id/65642faa8b95b587147e4a99
failing since 13 days (last pass: v6.4-rc6-195-g40f71e7cd3c6, first fail: v6.7-rc1-12-g9bacdd8996c7) 2023-11-27T05:56:28.894298 / # # 2023-11-27T05:56:30.050329 export SHELL=/bin/sh 2023-11-27T05:56:30.055989 # 2023-11-27T05:56:31.598388 / # export SHELL=/bin/sh. /lava-1260669/environment 2023-11-27T05:56:31.604033 2023-11-27T05:56:31.604397 / # . /lava-1260669/environment 2023-11-27T05:56:34.416369 / # /lava-1260669/bin/lava-test-runner /lava-1260669/1 2023-11-27T05:56:34.433772 /lava-1260669/bin/lava-test-runner /lava-1260669/1 2023-11-27T05:56:34.523732 + export 'TESTRUN_ID=1_bootrr' 2023-11-27T05:56:34.524085 + cd /lava-1260669/1/tests/1_bootrr ... (10 line(s) more) platform | arch | lab | compiler | defconfig | regressions -----------------------------+-------+---------------+----------+------------------------------+------------ r8a774c0-ek874 | arm64 | lab-cip | gcc-10 | defconfig+videodec | 1 Details:
https://kernelci.org/test/plan/id/6564293e308ad43eba7e4b23
Results: 5 PASS, 1 FAIL, 1 SKIP Full config: defconfig+videodec Compiler: gcc-10 (aarch64-linux-gnu-gcc (Debian 10.2.1-6) 10.2.1 20210110) Plain log:
https://storage.kernelci.org//mainline/master/v6.7-rc3/arm64/defconfig+vide…
HTML log:
https://storage.kernelci.org//mainline/master/v6.7-rc3/arm64/defconfig+vide…
Rootfs:
http://storage.kernelci.org/images/rootfs/buildroot/buildroot-baseline/2023…
* baseline.bootrr.deferred-probe-empty:
https://kernelci.org/test/case/id/6564293e308ad43eba7e4b2c
failing since 3 days (last pass: v6.7-rc2-95-gd3fa86b1a7b4, first fail: v6.7-rc2-147-gf1a09972a45a) 2023-11-27T05:29:11.032208 / # # 2023-11-27T05:29:12.490378 export SHELL=/bin/sh 2023-11-27T05:29:12.510956 # 2023-11-27T05:29:12.511465 / # export SHELL=/bin/sh 2023-11-27T05:29:14.461113 / # . /lava-1046344/environment 2023-11-27T05:29:18.046358 /lava-1046344/bin/lava-test-runner /lava-1046344/1 2023-11-27T05:29:18.067780 . /lava-1046344/environment 2023-11-27T05:29:18.068163 / # /lava-1046344/bin/lava-test-runner /lava-1046344/1 2023-11-27T05:29:18.148387 + export 'TESTRUN_ID=1_bootrr' 2023-11-27T05:29:18.148898 + cd /lava-1046344/1/tests/1_bootrr ... (26 line(s) more) platform | arch | lab | compiler | defconfig | regressions -----------------------------+-------+---------------+----------+------------------------------+------------ rk3399-rock-pi-4b | arm64 | lab-collabora | gcc-10 | defconfig+videodec | 1 Details:
https://kernelci.org/test/plan/id/656429bbd5f288fd9f7e4a6d
Results: 0 PASS, 1 FAIL, 0 SKIP Full config: defconfig+videodec Compiler: gcc-10 (aarch64-linux-gnu-gcc (Debian 10.2.1-6) 10.2.1 20210110) Plain log:
https://storage.kernelci.org//mainline/master/v6.7-rc3/arm64/defconfig+vide…
HTML log:
https://storage.kernelci.org//mainline/master/v6.7-rc3/arm64/defconfig+vide…
Rootfs:
http://storage.kernelci.org/images/rootfs/buildroot/buildroot-baseline/2023…
* baseline.login:
https://kernelci.org/test/case/id/656429bbd5f288fd9f7e4a6e
new failure (last pass: v6.7-rc2-195-g0f5cc96c367f2) platform | arch | lab | compiler | defconfig | regressions -----------------------------+-------+---------------+----------+------------------------------+------------ sun7i-a20-cubieboard2 | arm | lab-clabbe | gcc-10 | multi_v7_defconfig | 1 Details:
https://kernelci.org/test/plan/id/656429c49bce29c4d37e4a89
Results: 5 PASS, 1 FAIL, 1 SKIP Full config: multi_v7_defconfig Compiler: gcc-10 (arm-linux-gnueabihf-gcc (Debian 10.2.1-6) 10.2.1 20210110) Plain log:
https://storage.kernelci.org//mainline/master/v6.7-rc3/arm/multi_v7_defconf…
HTML log:
https://storage.kernelci.org//mainline/master/v6.7-rc3/arm/multi_v7_defconf…
Rootfs:
http://storage.kernelci.org/images/rootfs/buildroot/buildroot-baseline/2023…
* baseline.bootrr.deferred-probe-empty:
https://kernelci.org/test/case/id/656429c49bce29c4d37e4a92
failing since 13 days (last pass: v6.4-rc5-16-ga4d7d7011219, first fail: v6.7-rc1-12-g9bacdd8996c7) 2023-11-27T05:31:19.337731 + set +x 2023-11-27T05:31:19.339551 [ 20.780479] <LAVA_SIGNAL_ENDRUN 0_dmesg 445460_1.5.2.4.1> 2023-11-27T05:31:19.447662 / # # 2023-11-27T05:31:19.549532 export SHELL=/bin/sh 2023-11-27T05:31:19.550166 # 2023-11-27T05:31:19.651163 / # export SHELL=/bin/sh. /lava-445460/environment 2023-11-27T05:31:19.651749 2023-11-27T05:31:19.752772 / # . /lava-445460/environment/lava-445460/bin/lava-test-runner /lava-445460/1 2023-11-27T05:31:19.753729 2023-11-27T05:31:19.756804 / # /lava-445460/bin/lava-test-runner /lava-445460/1 ... (12 line(s) more) platform | arch | lab | compiler | defconfig | regressions -----------------------------+-------+---------------+----------+------------------------------+------------ sun7i-a20-cubieboard2 | arm | lab-clabbe | gcc-10 | multi_v7_defc...MB2_KERNEL=y | 1 Details:
https://kernelci.org/test/plan/id/65642c045537cbcc317e4a73
Results: 5 PASS, 1 FAIL, 1 SKIP Full config: multi_v7_defconfig+CONFIG_THUMB2_KERNEL=y Compiler: gcc-10 (arm-linux-gnueabihf-gcc (Debian 10.2.1-6) 10.2.1 20210110) Plain log:
https://storage.kernelci.org//mainline/master/v6.7-rc3/arm/multi_v7_defconf…
HTML log:
https://storage.kernelci.org//mainline/master/v6.7-rc3/arm/multi_v7_defconf…
Rootfs:
http://storage.kernelci.org/images/rootfs/buildroot/buildroot-baseline/2023…
* baseline.bootrr.deferred-probe-empty:
https://kernelci.org/test/case/id/65642c045537cbcc317e4a7c
failing since 13 days (last pass: v6.4-rc5-16-ga4d7d7011219, first fail: v6.7-rc1-12-g9bacdd8996c7) 2023-11-27T05:41:12.113756 + set +x 2023-11-27T05:41:12.115765 [ 20.796467] <LAVA_SIGNAL_ENDRUN 0_dmesg 445466_1.5.2.4.1> 2023-11-27T05:41:12.224305 / # # 2023-11-27T05:41:12.326642 export SHELL=/bin/sh 2023-11-27T05:41:12.327327 # 2023-11-27T05:41:12.428530 / # export SHELL=/bin/sh. /lava-445466/environment 2023-11-27T05:41:12.429413 2023-11-27T05:41:12.530780 / # . /lava-445466/environment/lava-445466/bin/lava-test-runner /lava-445466/1 2023-11-27T05:41:12.531947 2023-11-27T05:41:12.534465 / # /lava-445466/bin/lava-test-runner /lava-445466/1 ... (12 line(s) more) platform | arch | lab | compiler | defconfig | regressions -----------------------------+-------+---------------+----------+------------------------------+------------ sun7i-a20-cubieboard2 | arm | lab-clabbe | gcc-10 | multi_v7_defc...CONFIG_SMP=n | 1 Details:
https://kernelci.org/test/plan/id/65642e5c507b67894a7e4ac6
Results: 5 PASS, 1 FAIL, 1 SKIP Full config: multi_v7_defconfig+CONFIG_SMP=n Compiler: gcc-10 (arm-linux-gnueabihf-gcc (Debian 10.2.1-6) 10.2.1 20210110) Plain log:
https://storage.kernelci.org//mainline/master/v6.7-rc3/arm/multi_v7_defconf…
HTML log:
https://storage.kernelci.org//mainline/master/v6.7-rc3/arm/multi_v7_defconf…
Rootfs:
http://storage.kernelci.org/images/rootfs/buildroot/buildroot-baseline/2023…
* baseline.bootrr.deferred-probe-empty:
https://kernelci.org/test/case/id/65642e5d507b67894a7e4acf
failing since 13 days (last pass: v6.4-rc5-16-ga4d7d7011219, first fail: v6.7-rc1-12-g9bacdd8996c7) 2023-11-27T05:51:09.865048 + set +x 2023-11-27T05:51:09.866992 [ 23.835251] <LAVA_SIGNAL_ENDRUN 0_dmesg 445473_1.5.2.4.1> 2023-11-27T05:51:09.975034 / # # 2023-11-27T05:51:10.076605 export SHELL=/bin/sh 2023-11-27T05:51:10.077148 # 2023-11-27T05:51:10.178159 / # export SHELL=/bin/sh. /lava-445473/environment 2023-11-27T05:51:10.178812 2023-11-27T05:51:10.279817 / # . /lava-445473/environment/lava-445473/bin/lava-test-runner /lava-445473/1 2023-11-27T05:51:10.280726 2023-11-27T05:51:10.283422 / # /lava-445473/bin/lava-test-runner /lava-445473/1 ... (12 line(s) more) platform | arch | lab | compiler | defconfig | regressions -----------------------------+-------+---------------+----------+------------------------------+------------ sun8i-h2-plus...ch-all-h3-cc | arm | lab-baylibre | gcc-10 | sunxi_defconfig | 1 Details:
https://kernelci.org/test/plan/id/656424ad833a726b3c7e4a7d
Results: 5 PASS, 1 FAIL, 1 SKIP Full config: sunxi_defconfig Compiler: gcc-10 (arm-linux-gnueabihf-gcc (Debian 10.2.1-6) 10.2.1 20210110) Plain log:
https://storage.kernelci.org//mainline/master/v6.7-rc3/arm/sunxi_defconfig/…
HTML log:
https://storage.kernelci.org//mainline/master/v6.7-rc3/arm/sunxi_defconfig/…
Rootfs:
http://storage.kernelci.org/images/rootfs/buildroot/buildroot-baseline/2023…
* baseline.bootrr.deferred-probe-empty:
https://kernelci.org/test/case/id/656424ad833a726b3c7e4a86
failing since 7 days (last pass: v6.7-rc1-366-geb3479bc23fa, first fail: v6.7-rc2) 2023-11-27T05:09:38.742031 / # # 2023-11-27T05:09:38.843095 export SHELL=/bin/sh 2023-11-27T05:09:38.843419 # 2023-11-27T05:09:38.944166 / # export SHELL=/bin/sh. /lava-3849175/environment 2023-11-27T05:09:38.944494 2023-11-27T05:09:39.045252 / # . /lava-3849175/environment/lava-3849175/bin/lava-test-runner /lava-3849175/1 2023-11-27T05:09:39.045793 2023-11-27T05:09:39.069885 / # /lava-3849175/bin/lava-test-runner /lava-3849175/1 2023-11-27T05:09:39.210830 + export 'TESTRUN_ID=1_bootrr' 2023-11-27T05:09:39.211240 + cd /lava-3849175/1/tests/1_bootrr ... (10 line(s) more) platform | arch | lab | compiler | defconfig | regressions -----------------------------+-------+---------------+----------+------------------------------+------------ sun8i-h2-plus-orangepi-zero | arm | lab-baylibre | gcc-10 | sunxi_defconfig | 1 Details:
https://kernelci.org/test/plan/id/6564249a562f7c02897e4a82
Results: 5 PASS, 1 FAIL, 1 SKIP Full config: sunxi_defconfig Compiler: gcc-10 (arm-linux-gnueabihf-gcc (Debian 10.2.1-6) 10.2.1 20210110) Plain log:
https://storage.kernelci.org//mainline/master/v6.7-rc3/arm/sunxi_defconfig/…
HTML log:
https://storage.kernelci.org//mainline/master/v6.7-rc3/arm/sunxi_defconfig/…
Rootfs:
http://storage.kernelci.org/images/rootfs/buildroot/buildroot-baseline/2023…
* baseline.bootrr.deferred-probe-empty:
https://kernelci.org/test/case/id/6564249a562f7c02897e4a8b
failing since 228 days (last pass: v6.3-rc5-32-g99ddf2254feb, first fail: v6.3-rc6-34-ge62252bc55b6) 2023-11-27T05:09:32.191062 + set +x<8>[ 9.832100] <LAVA_SIGNAL_ENDRUN 0_dmesg 3849177_1.5.2.4.1> 2023-11-27T05:09:32.191292 2023-11-27T05:09:32.296059 / # # 2023-11-27T05:09:32.397297 export SHELL=/bin/sh 2023-11-27T05:09:32.397683 # 2023-11-27T05:09:32.498511 / # export SHELL=/bin/sh. /lava-3849177/environment 2023-11-27T05:09:32.498891 2023-11-27T05:09:32.599726 / # . /lava-3849177/environment/lava-3849177/bin/lava-test-runner /lava-3849177/1 2023-11-27T05:09:32.600359 2023-11-27T05:09:32.644785 / # /lava-3849177/bin/lava-test-runner /lava-3849177/1 ... (12 line(s) more) platform | arch | lab | compiler | defconfig | regressions -----------------------------+-------+---------------+----------+------------------------------+------------ zynqmp-zcu102 | arm64 | lab-cip | gcc-10 | defconfig+debug | 1 Details:
https://kernelci.org/test/plan/id/65642c1e5537cbcc317e4b57
Results: 0 PASS, 1 FAIL, 0 SKIP Full config: defconfig+debug Compiler: gcc-10 (aarch64-linux-gnu-gcc (Debian 10.2.1-6) 10.2.1 20210110) Plain log:
https://storage.kernelci.org//mainline/master/v6.7-rc3/arm64/defconfig+debu…
HTML log:
https://storage.kernelci.org//mainline/master/v6.7-rc3/arm64/defconfig+debu…
Rootfs:
http://storage.kernelci.org/images/rootfs/buildroot/buildroot-baseline/2023…
* baseline.login:
https://kernelci.org/test/case/id/65642c1e5537cbcc317e4b58
new failure (last pass: v6.7-rc2-195-g0f5cc96c367f2)
1 year, 4 months
1
0
0
0
mainline/master build: 189 builds: 6 failed, 183 passed, 11 errors, 13 warnings (v6.7-rc3)
by kernelci.org bot
mainline/master build: 189 builds: 6 failed, 183 passed, 11 errors, 13 warnings (v6.7-rc3) Full Build Summary:
https://kernelci.org/build/mainline/branch/master/kernel/v6.7-rc3/
Tree: mainline Branch: master Git Describe: v6.7-rc3 Git Commit: 2cc14f52aeb78ce3f29677c2de1f06c0e91471ab Git URL:
https://git.kernel.org/pub/scm/linux/kernel/git/torvalds/linux.git
Built: 8 unique architectures Build Failures Detected: arc: haps_hs_smp_defconfig+kselftest: (gcc-10) FAIL arm: allnoconfig: (clang-11) FAIL aspeed_g5_defconfig: (clang-11) FAIL multi_v5_defconfig: (clang-11) FAIL multi_v7_defconfig: (clang-11) FAIL rpc_defconfig: (gcc-10) FAIL Errors and Warnings Detected: arc: haps_hs_smp_defconfig+kselftest (gcc-10): 1 error arm64: arm: allnoconfig (clang-11): 1 error aspeed_g5_defconfig (clang-11): 2 errors multi_v5_defconfig (clang-11): 2 errors multi_v7_defconfig (clang-11): 3 errors rpc_defconfig (gcc-10): 2 errors i386: mips: riscv: sparc: allnoconfig (gcc-10): 1 warning sparc32_defconfig (gcc-10): 2 warnings sparc64_defconfig (gcc-10): 4 warnings sparc64_defconfig+debug (gcc-10): 2 warnings sparc64_defconfig+kselftest (gcc-10): 2 warnings tinyconfig (gcc-10): 1 warning x86_64: x86_64_defconfig+kselftest (rustc-1.73): 1 warning Errors summary: 3 clang: error: argument unused during compilation: '-Wa,-march=armv7-a' [-Werror,-Wunused-command-line-argument] 2 clang: error: argument unused during compilation: '-Wa,-march=armv6k' [-Werror,-Wunused-command-line-argument] 2 clang: error: argument unused during compilation: '-Wa,-march=armv5te' [-Werror,-Wunused-command-line-argument] 1 fs/proc/task_mmu.c:2099:21: error: 'HPAGE_SIZE' undeclared (first use in this function); did you mean 'PAGE_SIZE'? 1 clang: error: unsupported argument '-mimplicit-it=always' to option 'Wa,' 1 arch/arm/kernel/head.S:319: Error: missing expression -- `ldr r7,=0x' 1 arch/arm/kernel/head.S:319: Error: missing expression -- `ldr r3,=0x' Warnings summary: 10 <stdin>:1519:2: warning: #warning syscall clone3 not implemented [-Wcpp] 2 WARNING: modpost: EXPORT symbol "_mcount" [vmlinux] version generation failed, symbol will not be versioned. 1 vmlinux.o: warning: objtool: set_ftrace_ops_ro+0x23: relocation to !ENDBR: .text+0x14bd6b ================================================================================ Detailed per-defconfig build reports: -------------------------------------------------------------------------------- 32r2el_defconfig (mips, gcc-10) — PASS, 0 errors, 0 warnings, 0 section mismatches -------------------------------------------------------------------------------- 32r2el_defconfig+debug (mips, gcc-10) — PASS, 0 errors, 0 warnings, 0 section mismatches -------------------------------------------------------------------------------- 32r2el_defconfig+kselftest (mips, gcc-10) — PASS, 0 errors, 0 warnings, 0 section mismatches -------------------------------------------------------------------------------- allnoconfig (sparc, gcc-10) — PASS, 0 errors, 1 warning, 0 section mismatches Warnings: <stdin>:1519:2: warning: #warning syscall clone3 not implemented [-Wcpp] -------------------------------------------------------------------------------- allnoconfig (arc, gcc-10) — PASS, 0 errors, 0 warnings, 0 section mismatches -------------------------------------------------------------------------------- allnoconfig (i386, clang-11) — PASS, 0 errors, 0 warnings, 0 section mismatches -------------------------------------------------------------------------------- allnoconfig (i386, gcc-10) — PASS, 0 errors, 0 warnings, 0 section mismatches -------------------------------------------------------------------------------- allnoconfig (i386, clang-16) — PASS, 0 errors, 0 warnings, 0 section mismatches -------------------------------------------------------------------------------- allnoconfig (arm, clang-11) — FAIL, 1 error, 0 warnings, 0 section mismatches Errors: clang: error: unsupported argument '-mimplicit-it=always' to option 'Wa,' -------------------------------------------------------------------------------- allnoconfig (x86_64, clang-11) — PASS, 0 errors, 0 warnings, 0 section mismatches -------------------------------------------------------------------------------- allnoconfig (x86_64, clang-16) — PASS, 0 errors, 0 warnings, 0 section mismatches -------------------------------------------------------------------------------- allnoconfig (x86_64, gcc-10) — PASS, 0 errors, 0 warnings, 0 section mismatches -------------------------------------------------------------------------------- am200epdkit_defconfig (arm, gcc-10) — PASS, 0 errors, 0 warnings, 0 section mismatches -------------------------------------------------------------------------------- aspeed_g4_defconfig (arm, gcc-10) — PASS, 0 errors, 0 warnings, 0 section mismatches -------------------------------------------------------------------------------- aspeed_g5_defconfig (arm, clang-16) — PASS, 0 errors, 0 warnings, 0 section mismatches -------------------------------------------------------------------------------- aspeed_g5_defconfig (arm, clang-11) — FAIL, 2 errors, 0 warnings, 0 section mismatches Errors: clang: error: argument unused during compilation: '-Wa,-march=armv6k' [-Werror,-Wunused-command-line-argument] clang: error: argument unused during compilation: '-Wa,-march=armv6k' [-Werror,-Wunused-command-line-argument] -------------------------------------------------------------------------------- aspeed_g5_defconfig (arm, gcc-10) — PASS, 0 errors, 0 warnings, 0 section mismatches -------------------------------------------------------------------------------- assabet_defconfig (arm, gcc-10) — PASS, 0 errors, 0 warnings, 0 section mismatches -------------------------------------------------------------------------------- at91_dt_defconfig (arm, gcc-10) — PASS, 0 errors, 0 warnings, 0 section mismatches -------------------------------------------------------------------------------- ath25_defconfig (mips, gcc-10) — PASS, 0 errors, 0 warnings, 0 section mismatches -------------------------------------------------------------------------------- ath79_defconfig (mips, gcc-10) — PASS, 0 errors, 0 warnings, 0 section mismatches -------------------------------------------------------------------------------- axm55xx_defconfig (arm, gcc-10) — PASS, 0 errors, 0 warnings, 0 section mismatches -------------------------------------------------------------------------------- axs103_defconfig (arc, gcc-10) — PASS, 0 errors, 0 warnings, 0 section mismatches -------------------------------------------------------------------------------- axs103_smp_defconfig (arc, gcc-10) — PASS, 0 errors, 0 warnings, 0 section mismatches -------------------------------------------------------------------------------- bcm2835_defconfig (arm, gcc-10) — PASS, 0 errors, 0 warnings, 0 section mismatches -------------------------------------------------------------------------------- bcm47xx_defconfig (mips, gcc-10) — PASS, 0 errors, 0 warnings, 0 section mismatches -------------------------------------------------------------------------------- bcm63xx_defconfig (mips, gcc-10) — PASS, 0 errors, 0 warnings, 0 section mismatches -------------------------------------------------------------------------------- bigsur_defconfig (mips, gcc-10) — PASS, 0 errors, 0 warnings, 0 section mismatches -------------------------------------------------------------------------------- bmips_be_defconfig (mips, gcc-10) — PASS, 0 errors, 0 warnings, 0 section mismatches -------------------------------------------------------------------------------- bmips_stb_defconfig (mips, gcc-10) — PASS, 0 errors, 0 warnings, 0 section mismatches -------------------------------------------------------------------------------- cavium_octeon_defconfig (mips, gcc-10) — PASS, 0 errors, 0 warnings, 0 section mismatches -------------------------------------------------------------------------------- ci20_defconfig (mips, gcc-10) — PASS, 0 errors, 0 warnings, 0 section mismatches -------------------------------------------------------------------------------- cobalt_defconfig (mips, gcc-10) — PASS, 0 errors, 0 warnings, 0 section mismatches -------------------------------------------------------------------------------- collie_defconfig (arm, gcc-10) — PASS, 0 errors, 0 warnings, 0 section mismatches -------------------------------------------------------------------------------- cu1000-neo_defconfig (mips, gcc-10) — PASS, 0 errors, 0 warnings, 0 section mismatches -------------------------------------------------------------------------------- cu1830-neo_defconfig (mips, gcc-10) — PASS, 0 errors, 0 warnings, 0 section mismatches -------------------------------------------------------------------------------- davinci_all_defconfig (arm, gcc-10) — PASS, 0 errors, 0 warnings, 0 section mismatches -------------------------------------------------------------------------------- db1xxx_defconfig (mips, gcc-10) — PASS, 0 errors, 0 warnings, 0 section mismatches -------------------------------------------------------------------------------- decstation_64_defconfig (mips, gcc-10) — PASS, 0 errors, 0 warnings, 0 section mismatches -------------------------------------------------------------------------------- decstation_defconfig (mips, gcc-10) — PASS, 0 errors, 0 warnings, 0 section mismatches -------------------------------------------------------------------------------- decstation_r4k_defconfig (mips, gcc-10) — PASS, 0 errors, 0 warnings, 0 section mismatches -------------------------------------------------------------------------------- defconfig (arm64, clang-16) — PASS, 0 errors, 0 warnings, 0 section mismatches -------------------------------------------------------------------------------- defconfig (riscv, gcc-10) — PASS, 0 errors, 0 warnings, 0 section mismatches -------------------------------------------------------------------------------- defconfig (arm64, clang-11) — PASS, 0 errors, 0 warnings, 0 section mismatches -------------------------------------------------------------------------------- defconfig (arm64, gcc-10) — PASS, 0 errors, 0 warnings, 0 section mismatches -------------------------------------------------------------------------------- defconfig (riscv, clang-16) — PASS, 0 errors, 0 warnings, 0 section mismatches -------------------------------------------------------------------------------- defconfig+CONFIG_CPU_BIG_ENDIAN=y (arm64, gcc-10) — PASS, 0 errors, 0 warnings, 0 section mismatches -------------------------------------------------------------------------------- defconfig+arm64-chromebook (arm64, gcc-10) — PASS, 0 errors, 0 warnings, 0 section mismatches -------------------------------------------------------------------------------- defconfig+arm64-chromebook+videodec (arm64, gcc-10) — PASS, 0 errors, 0 warnings, 0 section mismatches -------------------------------------------------------------------------------- defconfig+debug (riscv, gcc-10) — PASS, 0 errors, 0 warnings, 0 section mismatches -------------------------------------------------------------------------------- defconfig+debug (arm64, gcc-10) — PASS, 0 errors, 0 warnings, 0 section mismatches -------------------------------------------------------------------------------- defconfig+kselftest (arm64, gcc-10) — PASS, 0 errors, 0 warnings, 0 section mismatches -------------------------------------------------------------------------------- defconfig+videodec (arm64, gcc-10) — PASS, 0 errors, 0 warnings, 0 section mismatches -------------------------------------------------------------------------------- exynos_defconfig (arm, gcc-10) — PASS, 0 errors, 0 warnings, 0 section mismatches -------------------------------------------------------------------------------- footbridge_defconfig (arm, gcc-10) — PASS, 0 errors, 0 warnings, 0 section mismatches -------------------------------------------------------------------------------- fuloong2e_defconfig (mips, gcc-10) — PASS, 0 errors, 0 warnings, 0 section mismatches -------------------------------------------------------------------------------- gcw0_defconfig (mips, gcc-10) — PASS, 0 errors, 0 warnings, 0 section mismatches -------------------------------------------------------------------------------- gemini_defconfig (arm, gcc-10) — PASS, 0 errors, 0 warnings, 0 section mismatches -------------------------------------------------------------------------------- gpr_defconfig (mips, gcc-10) — PASS, 0 errors, 0 warnings, 0 section mismatches -------------------------------------------------------------------------------- h3600_defconfig (arm, gcc-10) — PASS, 0 errors, 0 warnings, 0 section mismatches -------------------------------------------------------------------------------- haps_hs_defconfig (arc, gcc-10) — PASS, 0 errors, 0 warnings, 0 section mismatches -------------------------------------------------------------------------------- haps_hs_smp_defconfig (arc, gcc-10) — PASS, 0 errors, 0 warnings, 0 section mismatches -------------------------------------------------------------------------------- haps_hs_smp_defconfig+debug (arc, gcc-10) — PASS, 0 errors, 0 warnings, 0 section mismatches -------------------------------------------------------------------------------- haps_hs_smp_defconfig+kselftest (arc, gcc-10) — FAIL, 1 error, 0 warnings, 0 section mismatches Errors: fs/proc/task_mmu.c:2099:21: error: 'HPAGE_SIZE' undeclared (first use in this function); did you mean 'PAGE_SIZE'? -------------------------------------------------------------------------------- hisi_defconfig (arm, gcc-10) — PASS, 0 errors, 0 warnings, 0 section mismatches -------------------------------------------------------------------------------- hsdk_defconfig (arc, gcc-10) — PASS, 0 errors, 0 warnings, 0 section mismatches -------------------------------------------------------------------------------- i386_defconfig (i386, clang-11) — PASS, 0 errors, 0 warnings, 0 section mismatches -------------------------------------------------------------------------------- i386_defconfig (i386, gcc-10) — PASS, 0 errors, 0 warnings, 0 section mismatches -------------------------------------------------------------------------------- i386_defconfig (i386, clang-16) — PASS, 0 errors, 0 warnings, 0 section mismatches -------------------------------------------------------------------------------- i386_defconfig+debug (i386, gcc-10) — PASS, 0 errors, 0 warnings, 0 section mismatches -------------------------------------------------------------------------------- i386_defconfig+kselftest (i386, gcc-10) — PASS, 0 errors, 0 warnings, 0 section mismatches -------------------------------------------------------------------------------- imx_v4_v5_defconfig (arm, gcc-10) — PASS, 0 errors, 0 warnings, 0 section mismatches -------------------------------------------------------------------------------- imx_v6_v7_defconfig (arm, gcc-10) — PASS, 0 errors, 0 warnings, 0 section mismatches -------------------------------------------------------------------------------- imxrt_defconfig (arm, gcc-10) — PASS, 0 errors, 0 warnings, 0 section mismatches -------------------------------------------------------------------------------- integrator_defconfig (arm, gcc-10) — PASS, 0 errors, 0 warnings, 0 section mismatches -------------------------------------------------------------------------------- ip22_defconfig (mips, gcc-10) — PASS, 0 errors, 0 warnings, 0 section mismatches -------------------------------------------------------------------------------- ip27_defconfig (mips, gcc-10) — PASS, 0 errors, 0 warnings, 0 section mismatches -------------------------------------------------------------------------------- ip28_defconfig (mips, gcc-10) — PASS, 0 errors, 0 warnings, 0 section mismatches -------------------------------------------------------------------------------- ip32_defconfig (mips, gcc-10) — PASS, 0 errors, 0 warnings, 0 section mismatches -------------------------------------------------------------------------------- ixp4xx_defconfig (arm, gcc-10) — PASS, 0 errors, 0 warnings, 0 section mismatches -------------------------------------------------------------------------------- jazz_defconfig (mips, gcc-10) — PASS, 0 errors, 0 warnings, 0 section mismatches -------------------------------------------------------------------------------- jornada720_defconfig (arm, gcc-10) — PASS, 0 errors, 0 warnings, 0 section mismatches -------------------------------------------------------------------------------- keystone_defconfig (arm, gcc-10) — PASS, 0 errors, 0 warnings, 0 section mismatches -------------------------------------------------------------------------------- lemote2f_defconfig (mips, gcc-10) — PASS, 0 errors, 0 warnings, 0 section mismatches -------------------------------------------------------------------------------- loongson1b_defconfig (mips, gcc-10) — PASS, 0 errors, 0 warnings, 0 section mismatches -------------------------------------------------------------------------------- loongson1c_defconfig (mips, gcc-10) — PASS, 0 errors, 0 warnings, 0 section mismatches -------------------------------------------------------------------------------- loongson2k_defconfig (mips, gcc-10) — PASS, 0 errors, 0 warnings, 0 section mismatches -------------------------------------------------------------------------------- loongson3_defconfig (mips, gcc-10) — PASS, 0 errors, 0 warnings, 0 section mismatches -------------------------------------------------------------------------------- lpc18xx_defconfig (arm, gcc-10) — PASS, 0 errors, 0 warnings, 0 section mismatches -------------------------------------------------------------------------------- lpc32xx_defconfig (arm, gcc-10) — PASS, 0 errors, 0 warnings, 0 section mismatches -------------------------------------------------------------------------------- malta_defconfig (mips, gcc-10) — PASS, 0 errors, 0 warnings, 0 section mismatches -------------------------------------------------------------------------------- malta_kvm_defconfig (mips, gcc-10) — PASS, 0 errors, 0 warnings, 0 section mismatches -------------------------------------------------------------------------------- malta_qemu_32r6_defconfig (mips, gcc-10) — PASS, 0 errors, 0 warnings, 0 section mismatches -------------------------------------------------------------------------------- maltaaprp_defconfig (mips, gcc-10) — PASS, 0 errors, 0 warnings, 0 section mismatches -------------------------------------------------------------------------------- maltasmvp_defconfig (mips, gcc-10) — PASS, 0 errors, 0 warnings, 0 section mismatches -------------------------------------------------------------------------------- maltasmvp_eva_defconfig (mips, gcc-10) — PASS, 0 errors, 0 warnings, 0 section mismatches -------------------------------------------------------------------------------- maltaup_defconfig (mips, gcc-10) — PASS, 0 errors, 0 warnings, 0 section mismatches -------------------------------------------------------------------------------- maltaup_xpa_defconfig (mips, gcc-10) — PASS, 0 errors, 0 warnings, 0 section mismatches -------------------------------------------------------------------------------- milbeaut_m10v_defconfig (arm, gcc-10) — PASS, 0 errors, 0 warnings, 0 section mismatches -------------------------------------------------------------------------------- mmp2_defconfig (arm, gcc-10) — PASS, 0 errors, 0 warnings, 0 section mismatches -------------------------------------------------------------------------------- moxart_defconfig (arm, gcc-10) — PASS, 0 errors, 0 warnings, 0 section mismatches -------------------------------------------------------------------------------- mps2_defconfig (arm, gcc-10) — PASS, 0 errors, 0 warnings, 0 section mismatches -------------------------------------------------------------------------------- mtx1_defconfig (mips, gcc-10) — PASS, 0 errors, 0 warnings, 0 section mismatches -------------------------------------------------------------------------------- multi_v4t_defconfig (arm, gcc-10) — PASS, 0 errors, 0 warnings, 0 section mismatches -------------------------------------------------------------------------------- multi_v5_defconfig (arm, clang-11) — FAIL, 2 errors, 0 warnings, 0 section mismatches Errors: clang: error: argument unused during compilation: '-Wa,-march=armv5te' [-Werror,-Wunused-command-line-argument] clang: error: argument unused during compilation: '-Wa,-march=armv5te' [-Werror,-Wunused-command-line-argument] -------------------------------------------------------------------------------- multi_v5_defconfig (arm, clang-16) — PASS, 0 errors, 0 warnings, 0 section mismatches -------------------------------------------------------------------------------- multi_v5_defconfig (arm, gcc-10) — PASS, 0 errors, 0 warnings, 0 section mismatches -------------------------------------------------------------------------------- multi_v7_defconfig (arm, clang-11) — FAIL, 3 errors, 0 warnings, 0 section mismatches Errors: clang: error: argument unused during compilation: '-Wa,-march=armv7-a' [-Werror,-Wunused-command-line-argument] clang: error: argument unused during compilation: '-Wa,-march=armv7-a' [-Werror,-Wunused-command-line-argument] clang: error: argument unused during compilation: '-Wa,-march=armv7-a' [-Werror,-Wunused-command-line-argument] -------------------------------------------------------------------------------- multi_v7_defconfig (arm, gcc-10) — PASS, 0 errors, 0 warnings, 0 section mismatches -------------------------------------------------------------------------------- multi_v7_defconfig (arm, clang-16) — PASS, 0 errors, 0 warnings, 0 section mismatches -------------------------------------------------------------------------------- multi_v7_defconfig+CONFIG_CPU_BIG_ENDIAN=y (arm, gcc-10) — PASS, 0 errors, 0 warnings, 0 section mismatches -------------------------------------------------------------------------------- multi_v7_defconfig+CONFIG_EFI=y+CONFIG_ARM_LPAE=y (arm, gcc-10) — PASS, 0 errors, 0 warnings, 0 section mismatches -------------------------------------------------------------------------------- multi_v7_defconfig+CONFIG_SMP=n (arm, gcc-10) — PASS, 0 errors, 0 warnings, 0 section mismatches -------------------------------------------------------------------------------- multi_v7_defconfig+CONFIG_THUMB2_KERNEL=y (arm, gcc-10) — PASS, 0 errors, 0 warnings, 0 section mismatches -------------------------------------------------------------------------------- multi_v7_defconfig+kselftest (arm, gcc-10) — PASS, 0 errors, 0 warnings, 0 section mismatches -------------------------------------------------------------------------------- mvebu_v5_defconfig (arm, gcc-10) — PASS, 0 errors, 0 warnings, 0 section mismatches -------------------------------------------------------------------------------- mvebu_v7_defconfig (arm, gcc-10) — PASS, 0 errors, 0 warnings, 0 section mismatches -------------------------------------------------------------------------------- mxs_defconfig (arm, gcc-10) — PASS, 0 errors, 0 warnings, 0 section mismatches -------------------------------------------------------------------------------- neponset_defconfig (arm, gcc-10) — PASS, 0 errors, 0 warnings, 0 section mismatches -------------------------------------------------------------------------------- netwinder_defconfig (arm, gcc-10) — PASS, 0 errors, 0 warnings, 0 section mismatches -------------------------------------------------------------------------------- nhk8815_defconfig (arm, gcc-10) — PASS, 0 errors, 0 warnings, 0 section mismatches -------------------------------------------------------------------------------- nommu_k210_defconfig (riscv, clang-16) — PASS, 0 errors, 0 warnings, 0 section mismatches -------------------------------------------------------------------------------- nommu_k210_defconfig (riscv, gcc-10) — PASS, 0 errors, 0 warnings, 0 section mismatches -------------------------------------------------------------------------------- nommu_k210_sdcard_defconfig (riscv, clang-16) — PASS, 0 errors, 0 warnings, 0 section mismatches -------------------------------------------------------------------------------- nommu_k210_sdcard_defconfig (riscv, gcc-10) — PASS, 0 errors, 0 warnings, 0 section mismatches -------------------------------------------------------------------------------- nsimosci_hs_defconfig (arc, gcc-10) — PASS, 0 errors, 0 warnings, 0 section mismatches -------------------------------------------------------------------------------- nsimosci_hs_smp_defconfig (arc, gcc-10) — PASS, 0 errors, 0 warnings, 0 section mismatches -------------------------------------------------------------------------------- omap2plus_defconfig (arm, gcc-10) — PASS, 0 errors, 0 warnings, 0 section mismatches -------------------------------------------------------------------------------- omega2p_defconfig (mips, gcc-10) — PASS, 0 errors, 0 warnings, 0 section mismatches -------------------------------------------------------------------------------- orion5x_defconfig (arm, gcc-10) — PASS, 0 errors, 0 warnings, 0 section mismatches -------------------------------------------------------------------------------- pic32mzda_defconfig (mips, gcc-10) — PASS, 0 errors, 0 warnings, 0 section mismatches -------------------------------------------------------------------------------- pxa168_defconfig (arm, gcc-10) — PASS, 0 errors, 0 warnings, 0 section mismatches -------------------------------------------------------------------------------- pxa3xx_defconfig (arm, gcc-10) — PASS, 0 errors, 0 warnings, 0 section mismatches -------------------------------------------------------------------------------- pxa910_defconfig (arm, gcc-10) — PASS, 0 errors, 0 warnings, 0 section mismatches -------------------------------------------------------------------------------- pxa_defconfig (arm, gcc-10) — PASS, 0 errors, 0 warnings, 0 section mismatches -------------------------------------------------------------------------------- qcom_defconfig (arm, gcc-10) — PASS, 0 errors, 0 warnings, 0 section mismatches -------------------------------------------------------------------------------- qi_lb60_defconfig (mips, gcc-10) — PASS, 0 errors, 0 warnings, 0 section mismatches -------------------------------------------------------------------------------- rb532_defconfig (mips, gcc-10) — PASS, 0 errors, 0 warnings, 0 section mismatches -------------------------------------------------------------------------------- rbtx49xx_defconfig (mips, gcc-10) — PASS, 0 errors, 0 warnings, 0 section mismatches -------------------------------------------------------------------------------- realview_defconfig (arm, gcc-10) — PASS, 0 errors, 0 warnings, 0 section mismatches -------------------------------------------------------------------------------- rm200_defconfig (mips, gcc-10) — PASS, 0 errors, 0 warnings, 0 section mismatches -------------------------------------------------------------------------------- rpc_defconfig (arm, gcc-10) — FAIL, 2 errors, 0 warnings, 0 section mismatches Errors: arch/arm/kernel/head.S:319: Error: missing expression -- `ldr r7,=0x' arch/arm/kernel/head.S:319: Error: missing expression -- `ldr r3,=0x' -------------------------------------------------------------------------------- rs90_defconfig (mips, gcc-10) — PASS, 0 errors, 0 warnings, 0 section mismatches -------------------------------------------------------------------------------- rt305x_defconfig (mips, gcc-10) — PASS, 0 errors, 0 warnings, 0 section mismatches -------------------------------------------------------------------------------- rv32_defconfig (riscv, gcc-10) — PASS, 0 errors, 0 warnings, 0 section mismatches -------------------------------------------------------------------------------- rv32_defconfig (riscv, clang-16) — PASS, 0 errors, 0 warnings, 0 section mismatches -------------------------------------------------------------------------------- s3c6400_defconfig (arm, gcc-10) — PASS, 0 errors, 0 warnings, 0 section mismatches -------------------------------------------------------------------------------- s5pv210_defconfig (arm, gcc-10) — PASS, 0 errors, 0 warnings, 0 section mismatches -------------------------------------------------------------------------------- sama5_defconfig (arm, gcc-10) — PASS, 0 errors, 0 warnings, 0 section mismatches -------------------------------------------------------------------------------- sama7_defconfig (arm, gcc-10) — PASS, 0 errors, 0 warnings, 0 section mismatches -------------------------------------------------------------------------------- sb1250_swarm_defconfig (mips, gcc-10) — PASS, 0 errors, 0 warnings, 0 section mismatches -------------------------------------------------------------------------------- shmobile_defconfig (arm, gcc-10) — PASS, 0 errors, 0 warnings, 0 section mismatches -------------------------------------------------------------------------------- socfpga_defconfig (arm, gcc-10) — PASS, 0 errors, 0 warnings, 0 section mismatches -------------------------------------------------------------------------------- sp7021_defconfig (arm, gcc-10) — PASS, 0 errors, 0 warnings, 0 section mismatches -------------------------------------------------------------------------------- sparc32_defconfig (sparc, gcc-10) — PASS, 0 errors, 2 warnings, 0 section mismatches Warnings: <stdin>:1519:2: warning: #warning syscall clone3 not implemented [-Wcpp] <stdin>:1519:2: warning: #warning syscall clone3 not implemented [-Wcpp] -------------------------------------------------------------------------------- sparc64_defconfig (sparc, gcc-10) — PASS, 0 errors, 4 warnings, 0 section mismatches Warnings: <stdin>:1519:2: warning: #warning syscall clone3 not implemented [-Wcpp] WARNING: modpost: EXPORT symbol "_mcount" [vmlinux] version generation failed, symbol will not be versioned. <stdin>:1519:2: warning: #warning syscall clone3 not implemented [-Wcpp] WARNING: modpost: EXPORT symbol "_mcount" [vmlinux] version generation failed, symbol will not be versioned. -------------------------------------------------------------------------------- sparc64_defconfig+debug (sparc, gcc-10) — PASS, 0 errors, 2 warnings, 0 section mismatches Warnings: <stdin>:1519:2: warning: #warning syscall clone3 not implemented [-Wcpp] <stdin>:1519:2: warning: #warning syscall clone3 not implemented [-Wcpp] -------------------------------------------------------------------------------- sparc64_defconfig+kselftest (sparc, gcc-10) — PASS, 0 errors, 2 warnings, 0 section mismatches Warnings: <stdin>:1519:2: warning: #warning syscall clone3 not implemented [-Wcpp] <stdin>:1519:2: warning: #warning syscall clone3 not implemented [-Wcpp] -------------------------------------------------------------------------------- spear13xx_defconfig (arm, gcc-10) — PASS, 0 errors, 0 warnings, 0 section mismatches -------------------------------------------------------------------------------- spear3xx_defconfig (arm, gcc-10) — PASS, 0 errors, 0 warnings, 0 section mismatches -------------------------------------------------------------------------------- spear6xx_defconfig (arm, gcc-10) — PASS, 0 errors, 0 warnings, 0 section mismatches -------------------------------------------------------------------------------- spitz_defconfig (arm, gcc-10) — PASS, 0 errors, 0 warnings, 0 section mismatches -------------------------------------------------------------------------------- stm32_defconfig (arm, gcc-10) — PASS, 0 errors, 0 warnings, 0 section mismatches -------------------------------------------------------------------------------- sunxi_defconfig (arm, gcc-10) — PASS, 0 errors, 0 warnings, 0 section mismatches -------------------------------------------------------------------------------- tegra_defconfig (arm, gcc-10) — PASS, 0 errors, 0 warnings, 0 section mismatches -------------------------------------------------------------------------------- tinyconfig (x86_64, gcc-10) — PASS, 0 errors, 0 warnings, 0 section mismatches -------------------------------------------------------------------------------- tinyconfig (arc, gcc-10) — PASS, 0 errors, 0 warnings, 0 section mismatches -------------------------------------------------------------------------------- tinyconfig (sparc, gcc-10) — PASS, 0 errors, 1 warning, 0 section mismatches Warnings: <stdin>:1519:2: warning: #warning syscall clone3 not implemented [-Wcpp] -------------------------------------------------------------------------------- tinyconfig (i386, gcc-10) — PASS, 0 errors, 0 warnings, 0 section mismatches -------------------------------------------------------------------------------- u8500_defconfig (arm, gcc-10) — PASS, 0 errors, 0 warnings, 0 section mismatches -------------------------------------------------------------------------------- vdk_hs38_defconfig (arc, gcc-10) — PASS, 0 errors, 0 warnings, 0 section mismatches -------------------------------------------------------------------------------- vdk_hs38_smp_defconfig (arc, gcc-10) — PASS, 0 errors, 0 warnings, 0 section mismatches -------------------------------------------------------------------------------- versatile_defconfig (arm, gcc-10) — PASS, 0 errors, 0 warnings, 0 section mismatches -------------------------------------------------------------------------------- vexpress_defconfig (arm, gcc-10) — PASS, 0 errors, 0 warnings, 0 section mismatches -------------------------------------------------------------------------------- vf610m4_defconfig (arm, gcc-10) — PASS, 0 errors, 0 warnings, 0 section mismatches -------------------------------------------------------------------------------- vocore2_defconfig (mips, gcc-10) — PASS, 0 errors, 0 warnings, 0 section mismatches -------------------------------------------------------------------------------- vt8500_v6_v7_defconfig (arm, gcc-10) — PASS, 0 errors, 0 warnings, 0 section mismatches -------------------------------------------------------------------------------- wpcm450_defconfig (arm, gcc-10) — PASS, 0 errors, 0 warnings, 0 section mismatches -------------------------------------------------------------------------------- x86_64_defconfig (x86_64, gcc-10) — PASS, 0 errors, 0 warnings, 0 section mismatches -------------------------------------------------------------------------------- x86_64_defconfig (x86_64, clang-11) — PASS, 0 errors, 0 warnings, 0 section mismatches -------------------------------------------------------------------------------- x86_64_defconfig (x86_64, clang-16) — PASS, 0 errors, 0 warnings, 0 section mismatches -------------------------------------------------------------------------------- x86_64_defconfig (x86_64, rustc-1.73) — PASS, 0 errors, 0 warnings, 0 section mismatches -------------------------------------------------------------------------------- x86_64_defconfig+debug (x86_64, gcc-10) — PASS, 0 errors, 0 warnings, 0 section mismatches -------------------------------------------------------------------------------- x86_64_defconfig+kselftest (x86_64, rustc-1.73) — PASS, 0 errors, 1 warning, 0 section mismatches Warnings: vmlinux.o: warning: objtool: set_ftrace_ops_ro+0x23: relocation to !ENDBR: .text+0x14bd6b -------------------------------------------------------------------------------- x86_64_defconfig+kselftest (x86_64, gcc-10) — PASS, 0 errors, 0 warnings, 0 section mismatches -------------------------------------------------------------------------------- x86_64_defconfig+rust (x86_64, rustc-1.73) — PASS, 0 errors, 0 warnings, 0 section mismatches -------------------------------------------------------------------------------- x86_64_defconfig+rust-samples (x86_64, rustc-1.73) — PASS, 0 errors, 0 warnings, 0 section mismatches -------------------------------------------------------------------------------- x86_64_defconfig+x86-board (x86_64, gcc-10) — PASS, 0 errors, 0 warnings, 0 section mismatches -------------------------------------------------------------------------------- x86_64_defconfig+x86-board+kselftest (x86_64, gcc-10) — PASS, 0 errors, 0 warnings, 0 section mismatches --- For more info write to <info(a)kernelci.org>
1 year, 4 months
1
0
0
0
← Newer
1
...
9
10
11
12
13
14
15
...
53
Older →
Jump to page:
1
2
3
4
5
6
7
8
9
10
11
12
13
14
15
16
17
18
19
20
21
22
23
24
25
26
27
28
29
30
31
32
33
34
35
36
37
38
39
40
41
42
43
44
45
46
47
48
49
50
51
52
53
Results per page:
10
25
50
100
200