lists.linaro.org
Sign In
Sign Up
Sign In
Sign Up
Manage this list
×
Keyboard Shortcuts
Thread View
j
: Next unread message
k
: Previous unread message
j a
: Jump to all threads
j l
: Jump to MailingList overview
2025
March
February
January
2024
December
November
October
September
August
July
June
May
April
March
February
January
2023
December
November
October
September
August
July
June
May
April
March
February
January
2022
December
November
October
September
August
July
June
May
April
March
February
January
2021
December
November
October
September
August
July
June
May
April
March
February
January
2020
December
November
October
September
August
July
June
May
April
March
February
January
2019
December
November
October
September
August
July
June
May
April
March
February
January
2018
December
November
October
September
August
July
June
May
April
March
February
January
2017
December
November
October
September
August
July
June
May
April
March
February
January
2016
December
November
October
September
August
July
June
May
April
March
February
January
2015
December
November
October
September
August
July
June
May
April
March
February
January
2014
December
November
October
September
August
July
June
May
April
March
February
January
2013
December
November
October
September
August
List overview
Download
Kernel-build-reports
October 2021
----- 2025 -----
March 2025
February 2025
January 2025
----- 2024 -----
December 2024
November 2024
October 2024
September 2024
August 2024
July 2024
June 2024
May 2024
April 2024
March 2024
February 2024
January 2024
----- 2023 -----
December 2023
November 2023
October 2023
September 2023
August 2023
July 2023
June 2023
May 2023
April 2023
March 2023
February 2023
January 2023
----- 2022 -----
December 2022
November 2022
October 2022
September 2022
August 2022
July 2022
June 2022
May 2022
April 2022
March 2022
February 2022
January 2022
----- 2021 -----
December 2021
November 2021
October 2021
September 2021
August 2021
July 2021
June 2021
May 2021
April 2021
March 2021
February 2021
January 2021
----- 2020 -----
December 2020
November 2020
October 2020
September 2020
August 2020
July 2020
June 2020
May 2020
April 2020
March 2020
February 2020
January 2020
----- 2019 -----
December 2019
November 2019
October 2019
September 2019
August 2019
July 2019
June 2019
May 2019
April 2019
March 2019
February 2019
January 2019
----- 2018 -----
December 2018
November 2018
October 2018
September 2018
August 2018
July 2018
June 2018
May 2018
April 2018
March 2018
February 2018
January 2018
----- 2017 -----
December 2017
November 2017
October 2017
September 2017
August 2017
July 2017
June 2017
May 2017
April 2017
March 2017
February 2017
January 2017
----- 2016 -----
December 2016
November 2016
October 2016
September 2016
August 2016
July 2016
June 2016
May 2016
April 2016
March 2016
February 2016
January 2016
----- 2015 -----
December 2015
November 2015
October 2015
September 2015
August 2015
July 2015
June 2015
May 2015
April 2015
March 2015
February 2015
January 2015
----- 2014 -----
December 2014
November 2014
October 2014
September 2014
August 2014
July 2014
June 2014
May 2014
April 2014
March 2014
February 2014
January 2014
----- 2013 -----
December 2013
November 2013
October 2013
September 2013
August 2013
kernel-build-reports@lists.linaro.org
10 participants
959 discussions
Start a n
N
ew thread
clk/clk-next build: 197 builds: 7 failed, 190 passed, 8 errors, 17 warnings (clk-fixes-for-linus-185-gee7bfa2baf90)
by kernelci.org bot
clk/clk-next build: 197 builds: 7 failed, 190 passed, 8 errors, 17 warnings (clk-fixes-for-linus-185-gee7bfa2baf90) Full Build Summary:
https://kernelci.org/build/clk/branch/clk-next/kernel/clk-fixes-for-linus-1…
Tree: clk Branch: clk-next Git Describe: clk-fixes-for-linus-185-gee7bfa2baf90 Git Commit: ee7bfa2baf9012da64e9d7a0c60d21799397903a Git URL:
https://git.kernel.org/pub/scm/linux/kernel/git/clk/linux.git
Built: 7 unique architectures Build Failures Detected: arm: allmodconfig: (gcc-10) FAIL rpc_defconfig: (gcc-10) FAIL mips: decstation_64_defconfig: (gcc-10) FAIL ip27_defconfig: (gcc-10) FAIL ip28_defconfig: (gcc-10) FAIL lemote2f_defconfig: (gcc-10) FAIL x86_64: allmodconfig: (gcc-10) FAIL Errors and Warnings Detected: arc: haps_hs_smp_defconfig+kselftest (gcc-10): 3 warnings tinyconfig (gcc-10): 1 warning arm64: arm: allmodconfig (gcc-10): 1 error, 1 warning rpc_defconfig (gcc-10): 4 errors i386: mips: 32r2el_defconfig (gcc-10): 1 warning 32r2el_defconfig+kselftest (gcc-10): 1 warning lemote2f_defconfig (gcc-10): 1 warning loongson2k_defconfig (gcc-10): 1 warning rbtx49xx_defconfig (gcc-10): 1 warning rm200_defconfig (gcc-10): 1 warning riscv: rv32_defconfig (gcc-10): 6 warnings x86_64: allmodconfig (gcc-10): 3 errors Errors summary: 3 /usr/lib/gcc/x86_64-linux-gnu/10/plugin/include/config/i386/i386.h:2500:10: fatal error: common/config/i386/i386-cpuinfo.h: No such file or directory 2 arm-linux-gnueabihf-gcc: error: unrecognized -march target: armv3m 2 arm-linux-gnueabihf-gcc: error: missing argument to ‘-march=’ 1 drivers/cpufreq/vexpress-spc-cpufreq.c:454:6: error: unused variable ‘cur_cluster’ [-Werror=unused-variable] Warnings summary: 2 net/mac80211/mlme.c:4345:1: warning: the frame size of 1200 bytes is larger than 1024 bytes [-Wframe-larger-than=] 2 arch/mips/boot/dts/img/boston.dts:128.19-178.5: Warning (pci_device_reg): /pci@14000000/pci2_root@0,0,0: PCI unit address format error, expected "0,0" 2 arch/arc/Makefile:26: ** WARNING ** CONFIG_ARC_TUNE_MCPU flag '' is unknown, fallback to '' 2 <stdin>:834:2: warning: #warning syscall fstat64 not implemented [-Wcpp] 2 <stdin>:1515:2: warning: #warning syscall clone3 not implemented [-Wcpp] 2 <stdin>:1131:2: warning: #warning syscall fstatat64 not implemented [-Wcpp] 1 drivers/net/ethernet/8390/ne.c:909:20: warning: ‘ne_add_devices’ defined but not used [-Wunused-function] 1 drivers/block/paride/bpck.c:32: warning: "PC" redefined 1 cc1: all warnings being treated as errors 1 arch/arc/include/asm/perf_event.h:91:27: warning: 'arc_pmu_ev_hw_map' defined but not used [-Wunused-const-variable=] 1 arch/arc/include/asm/perf_event.h:126:27: warning: 'arc_pmu_cache_map' defined but not used [-Wunused-const-variable=] ================================================================================ Detailed per-defconfig build reports: -------------------------------------------------------------------------------- 32r2el_defconfig (mips, gcc-10) — PASS, 0 errors, 1 warning, 0 section mismatches Warnings: arch/mips/boot/dts/img/boston.dts:128.19-178.5: Warning (pci_device_reg): /pci@14000000/pci2_root@0,0,0: PCI unit address format error, expected "0,0" -------------------------------------------------------------------------------- 32r2el_defconfig+kselftest (mips, gcc-10) — PASS, 0 errors, 1 warning, 0 section mismatches Warnings: arch/mips/boot/dts/img/boston.dts:128.19-178.5: Warning (pci_device_reg): /pci@14000000/pci2_root@0,0,0: PCI unit address format error, expected "0,0" -------------------------------------------------------------------------------- allmodconfig (x86_64, gcc-10) — FAIL, 3 errors, 0 warnings, 0 section mismatches Errors: /usr/lib/gcc/x86_64-linux-gnu/10/plugin/include/config/i386/i386.h:2500:10: fatal error: common/config/i386/i386-cpuinfo.h: No such file or directory /usr/lib/gcc/x86_64-linux-gnu/10/plugin/include/config/i386/i386.h:2500:10: fatal error: common/config/i386/i386-cpuinfo.h: No such file or directory /usr/lib/gcc/x86_64-linux-gnu/10/plugin/include/config/i386/i386.h:2500:10: fatal error: common/config/i386/i386-cpuinfo.h: No such file or directory -------------------------------------------------------------------------------- allmodconfig (arm, gcc-10) — FAIL, 1 error, 1 warning, 0 section mismatches Errors: drivers/cpufreq/vexpress-spc-cpufreq.c:454:6: error: unused variable ‘cur_cluster’ [-Werror=unused-variable] Warnings: cc1: all warnings being treated as errors -------------------------------------------------------------------------------- allnoconfig (arc, gcc-10) — PASS, 0 errors, 0 warnings, 0 section mismatches -------------------------------------------------------------------------------- allnoconfig (x86_64, gcc-10) — PASS, 0 errors, 0 warnings, 0 section mismatches -------------------------------------------------------------------------------- allnoconfig (i386, gcc-10) — PASS, 0 errors, 0 warnings, 0 section mismatches -------------------------------------------------------------------------------- am200epdkit_defconfig (arm, gcc-10) — PASS, 0 errors, 0 warnings, 0 section mismatches -------------------------------------------------------------------------------- ar7_defconfig (mips, gcc-10) — PASS, 0 errors, 0 warnings, 0 section mismatches -------------------------------------------------------------------------------- aspeed_g4_defconfig (arm, gcc-10) — PASS, 0 errors, 0 warnings, 0 section mismatches -------------------------------------------------------------------------------- aspeed_g5_defconfig (arm, gcc-10) — PASS, 0 errors, 0 warnings, 0 section mismatches -------------------------------------------------------------------------------- assabet_defconfig (arm, gcc-10) — PASS, 0 errors, 0 warnings, 0 section mismatches -------------------------------------------------------------------------------- at91_dt_defconfig (arm, gcc-10) — PASS, 0 errors, 0 warnings, 0 section mismatches -------------------------------------------------------------------------------- ath79_defconfig (mips, gcc-10) — PASS, 0 errors, 0 warnings, 0 section mismatches -------------------------------------------------------------------------------- axm55xx_defconfig (arm, gcc-10) — PASS, 0 errors, 0 warnings, 0 section mismatches -------------------------------------------------------------------------------- axs103_defconfig (arc, gcc-10) — PASS, 0 errors, 0 warnings, 0 section mismatches -------------------------------------------------------------------------------- axs103_smp_defconfig (arc, gcc-10) — PASS, 0 errors, 0 warnings, 0 section mismatches -------------------------------------------------------------------------------- badge4_defconfig (arm, gcc-10) — PASS, 0 errors, 0 warnings, 0 section mismatches -------------------------------------------------------------------------------- bcm2835_defconfig (arm, gcc-10) — PASS, 0 errors, 0 warnings, 0 section mismatches -------------------------------------------------------------------------------- bcm47xx_defconfig (mips, gcc-10) — PASS, 0 errors, 0 warnings, 0 section mismatches -------------------------------------------------------------------------------- bcm63xx_defconfig (mips, gcc-10) — PASS, 0 errors, 0 warnings, 0 section mismatches -------------------------------------------------------------------------------- bigsur_defconfig (mips, gcc-10) — PASS, 0 errors, 0 warnings, 0 section mismatches -------------------------------------------------------------------------------- bmips_be_defconfig (mips, gcc-10) — PASS, 0 errors, 0 warnings, 0 section mismatches -------------------------------------------------------------------------------- bmips_stb_defconfig (mips, gcc-10) — PASS, 0 errors, 0 warnings, 0 section mismatches -------------------------------------------------------------------------------- capcella_defconfig (mips, gcc-10) — PASS, 0 errors, 0 warnings, 0 section mismatches -------------------------------------------------------------------------------- cavium_octeon_defconfig (mips, gcc-10) — PASS, 0 errors, 0 warnings, 0 section mismatches -------------------------------------------------------------------------------- cerfcube_defconfig (arm, gcc-10) — PASS, 0 errors, 0 warnings, 0 section mismatches -------------------------------------------------------------------------------- ci20_defconfig (mips, gcc-10) — PASS, 0 errors, 0 warnings, 0 section mismatches -------------------------------------------------------------------------------- cm_x300_defconfig (arm, gcc-10) — PASS, 0 errors, 0 warnings, 0 section mismatches -------------------------------------------------------------------------------- colibri_pxa270_defconfig (arm, gcc-10) — PASS, 0 errors, 0 warnings, 0 section mismatches -------------------------------------------------------------------------------- colibri_pxa300_defconfig (arm, gcc-10) — PASS, 0 errors, 0 warnings, 0 section mismatches -------------------------------------------------------------------------------- collie_defconfig (arm, gcc-10) — PASS, 0 errors, 0 warnings, 0 section mismatches -------------------------------------------------------------------------------- corgi_defconfig (arm, gcc-10) — PASS, 0 errors, 0 warnings, 0 section mismatches -------------------------------------------------------------------------------- cu1830-neo_defconfig (mips, gcc-10) — PASS, 0 errors, 0 warnings, 0 section mismatches -------------------------------------------------------------------------------- davinci_all_defconfig (arm, gcc-10) — PASS, 0 errors, 0 warnings, 0 section mismatches -------------------------------------------------------------------------------- db1xxx_defconfig (mips, gcc-10) — PASS, 0 errors, 0 warnings, 0 section mismatches -------------------------------------------------------------------------------- decstation_64_defconfig (mips, gcc-10) — FAIL, 0 errors, 0 warnings, 0 section mismatches -------------------------------------------------------------------------------- decstation_defconfig (mips, gcc-10) — PASS, 0 errors, 0 warnings, 0 section mismatches -------------------------------------------------------------------------------- decstation_r4k_defconfig (mips, gcc-10) — PASS, 0 errors, 0 warnings, 0 section mismatches -------------------------------------------------------------------------------- defconfig (riscv, gcc-10) — PASS, 0 errors, 0 warnings, 0 section mismatches -------------------------------------------------------------------------------- defconfig (arm64, gcc-10) — PASS, 0 errors, 0 warnings, 0 section mismatches -------------------------------------------------------------------------------- defconfig+CONFIG_CPU_BIG_ENDIAN=y (arm64, gcc-10) — PASS, 0 errors, 0 warnings, 0 section mismatches -------------------------------------------------------------------------------- defconfig+CONFIG_RANDOMIZE_BASE=y (arm64, gcc-10) — PASS, 0 errors, 0 warnings, 0 section mismatches -------------------------------------------------------------------------------- defconfig+crypto (arm64, gcc-10) — PASS, 0 errors, 0 warnings, 0 section mismatches -------------------------------------------------------------------------------- defconfig+ima (arm64, gcc-10) — PASS, 0 errors, 0 warnings, 0 section mismatches -------------------------------------------------------------------------------- defconfig+kselftest (riscv, gcc-10) — PASS, 0 errors, 0 warnings, 0 section mismatches -------------------------------------------------------------------------------- dove_defconfig (arm, gcc-10) — PASS, 0 errors, 0 warnings, 0 section mismatches -------------------------------------------------------------------------------- e55_defconfig (mips, gcc-10) — PASS, 0 errors, 0 warnings, 0 section mismatches -------------------------------------------------------------------------------- ep93xx_defconfig (arm, gcc-10) — PASS, 0 errors, 0 warnings, 0 section mismatches -------------------------------------------------------------------------------- eseries_pxa_defconfig (arm, gcc-10) — PASS, 0 errors, 0 warnings, 0 section mismatches -------------------------------------------------------------------------------- exynos_defconfig (arm, gcc-10) — PASS, 0 errors, 0 warnings, 0 section mismatches -------------------------------------------------------------------------------- ezx_defconfig (arm, gcc-10) — PASS, 0 errors, 0 warnings, 0 section mismatches -------------------------------------------------------------------------------- footbridge_defconfig (arm, gcc-10) — PASS, 0 errors, 0 warnings, 0 section mismatches -------------------------------------------------------------------------------- fuloong2e_defconfig (mips, gcc-10) — PASS, 0 errors, 0 warnings, 0 section mismatches -------------------------------------------------------------------------------- gcw0_defconfig (mips, gcc-10) — PASS, 0 errors, 0 warnings, 0 section mismatches -------------------------------------------------------------------------------- gemini_defconfig (arm, gcc-10) — PASS, 0 errors, 0 warnings, 0 section mismatches -------------------------------------------------------------------------------- gpr_defconfig (mips, gcc-10) — PASS, 0 errors, 0 warnings, 0 section mismatches -------------------------------------------------------------------------------- h3600_defconfig (arm, gcc-10) — PASS, 0 errors, 0 warnings, 0 section mismatches -------------------------------------------------------------------------------- h5000_defconfig (arm, gcc-10) — PASS, 0 errors, 0 warnings, 0 section mismatches -------------------------------------------------------------------------------- hackkit_defconfig (arm, gcc-10) — PASS, 0 errors, 0 warnings, 0 section mismatches -------------------------------------------------------------------------------- haps_hs_defconfig (arc, gcc-10) — PASS, 0 errors, 0 warnings, 0 section mismatches -------------------------------------------------------------------------------- haps_hs_smp_defconfig (arc, gcc-10) — PASS, 0 errors, 0 warnings, 0 section mismatches -------------------------------------------------------------------------------- haps_hs_smp_defconfig+kselftest (arc, gcc-10) — PASS, 0 errors, 3 warnings, 0 section mismatches Warnings: arch/arc/Makefile:26: ** WARNING ** CONFIG_ARC_TUNE_MCPU flag '' is unknown, fallback to '' arch/arc/include/asm/perf_event.h:126:27: warning: 'arc_pmu_cache_map' defined but not used [-Wunused-const-variable=] arch/arc/include/asm/perf_event.h:91:27: warning: 'arc_pmu_ev_hw_map' defined but not used [-Wunused-const-variable=] -------------------------------------------------------------------------------- hisi_defconfig (arm, gcc-10) — PASS, 0 errors, 0 warnings, 0 section mismatches -------------------------------------------------------------------------------- hsdk_defconfig (arc, gcc-10) — PASS, 0 errors, 0 warnings, 0 section mismatches -------------------------------------------------------------------------------- i386_defconfig (i386, gcc-10) — PASS, 0 errors, 0 warnings, 0 section mismatches -------------------------------------------------------------------------------- i386_defconfig+kselftest (i386, gcc-10) — PASS, 0 errors, 0 warnings, 0 section mismatches -------------------------------------------------------------------------------- imote2_defconfig (arm, gcc-10) — PASS, 0 errors, 0 warnings, 0 section mismatches -------------------------------------------------------------------------------- imx_v4_v5_defconfig (arm, gcc-10) — PASS, 0 errors, 0 warnings, 0 section mismatches -------------------------------------------------------------------------------- imx_v6_v7_defconfig (arm, gcc-10) — PASS, 0 errors, 0 warnings, 0 section mismatches -------------------------------------------------------------------------------- integrator_defconfig (arm, gcc-10) — PASS, 0 errors, 0 warnings, 0 section mismatches -------------------------------------------------------------------------------- iop32x_defconfig (arm, gcc-10) — PASS, 0 errors, 0 warnings, 0 section mismatches -------------------------------------------------------------------------------- ip22_defconfig (mips, gcc-10) — PASS, 0 errors, 0 warnings, 0 section mismatches -------------------------------------------------------------------------------- ip27_defconfig (mips, gcc-10) — FAIL, 0 errors, 0 warnings, 0 section mismatches -------------------------------------------------------------------------------- ip28_defconfig (mips, gcc-10) — FAIL, 0 errors, 0 warnings, 0 section mismatches -------------------------------------------------------------------------------- ip32_defconfig (mips, gcc-10) — PASS, 0 errors, 0 warnings, 0 section mismatches -------------------------------------------------------------------------------- ixp4xx_defconfig (arm, gcc-10) — PASS, 0 errors, 0 warnings, 0 section mismatches -------------------------------------------------------------------------------- jazz_defconfig (mips, gcc-10) — PASS, 0 errors, 0 warnings, 0 section mismatches -------------------------------------------------------------------------------- jmr3927_defconfig (mips, gcc-10) — PASS, 0 errors, 0 warnings, 0 section mismatches -------------------------------------------------------------------------------- jornada720_defconfig (arm, gcc-10) — PASS, 0 errors, 0 warnings, 0 section mismatches -------------------------------------------------------------------------------- keystone_defconfig (arm, gcc-10) — PASS, 0 errors, 0 warnings, 0 section mismatches -------------------------------------------------------------------------------- lart_defconfig (arm, gcc-10) — PASS, 0 errors, 0 warnings, 0 section mismatches -------------------------------------------------------------------------------- lemote2f_defconfig (mips, gcc-10) — FAIL, 0 errors, 1 warning, 0 section mismatches Warnings: net/mac80211/mlme.c:4345:1: warning: the frame size of 1200 bytes is larger than 1024 bytes [-Wframe-larger-than=] -------------------------------------------------------------------------------- loongson1b_defconfig (mips, gcc-10) — PASS, 0 errors, 0 warnings, 0 section mismatches -------------------------------------------------------------------------------- loongson1c_defconfig (mips, gcc-10) — PASS, 0 errors, 0 warnings, 0 section mismatches -------------------------------------------------------------------------------- loongson2k_defconfig (mips, gcc-10) — PASS, 0 errors, 1 warning, 0 section mismatches Warnings: net/mac80211/mlme.c:4345:1: warning: the frame size of 1200 bytes is larger than 1024 bytes [-Wframe-larger-than=] -------------------------------------------------------------------------------- loongson3_defconfig (mips, gcc-10) — PASS, 0 errors, 0 warnings, 0 section mismatches -------------------------------------------------------------------------------- lpc18xx_defconfig (arm, gcc-10) — PASS, 0 errors, 0 warnings, 0 section mismatches -------------------------------------------------------------------------------- lpc32xx_defconfig (arm, gcc-10) — PASS, 0 errors, 0 warnings, 0 section mismatches -------------------------------------------------------------------------------- lpd270_defconfig (arm, gcc-10) — PASS, 0 errors, 0 warnings, 0 section mismatches -------------------------------------------------------------------------------- lubbock_defconfig (arm, gcc-10) — PASS, 0 errors, 0 warnings, 0 section mismatches -------------------------------------------------------------------------------- magician_defconfig (arm, gcc-10) — PASS, 0 errors, 0 warnings, 0 section mismatches -------------------------------------------------------------------------------- mainstone_defconfig (arm, gcc-10) — PASS, 0 errors, 0 warnings, 0 section mismatches -------------------------------------------------------------------------------- malta_defconfig (mips, gcc-10) — PASS, 0 errors, 0 warnings, 0 section mismatches -------------------------------------------------------------------------------- malta_kvm_defconfig (mips, gcc-10) — PASS, 0 errors, 0 warnings, 0 section mismatches -------------------------------------------------------------------------------- malta_qemu_32r6_defconfig (mips, gcc-10) — PASS, 0 errors, 0 warnings, 0 section mismatches -------------------------------------------------------------------------------- maltaaprp_defconfig (mips, gcc-10) — PASS, 0 errors, 0 warnings, 0 section mismatches -------------------------------------------------------------------------------- maltasmvp_defconfig (mips, gcc-10) — PASS, 0 errors, 0 warnings, 0 section mismatches -------------------------------------------------------------------------------- maltasmvp_eva_defconfig (mips, gcc-10) — PASS, 0 errors, 0 warnings, 0 section mismatches -------------------------------------------------------------------------------- maltaup_defconfig (mips, gcc-10) — PASS, 0 errors, 0 warnings, 0 section mismatches -------------------------------------------------------------------------------- maltaup_xpa_defconfig (mips, gcc-10) — PASS, 0 errors, 0 warnings, 0 section mismatches -------------------------------------------------------------------------------- mini2440_defconfig (arm, gcc-10) — PASS, 0 errors, 0 warnings, 0 section mismatches -------------------------------------------------------------------------------- mmp2_defconfig (arm, gcc-10) — PASS, 0 errors, 0 warnings, 0 section mismatches -------------------------------------------------------------------------------- moxart_defconfig (arm, gcc-10) — PASS, 0 errors, 0 warnings, 0 section mismatches -------------------------------------------------------------------------------- mpc30x_defconfig (mips, gcc-10) — PASS, 0 errors, 0 warnings, 0 section mismatches -------------------------------------------------------------------------------- mps2_defconfig (arm, gcc-10) — PASS, 0 errors, 0 warnings, 0 section mismatches -------------------------------------------------------------------------------- mtx1_defconfig (mips, gcc-10) — PASS, 0 errors, 0 warnings, 0 section mismatches -------------------------------------------------------------------------------- multi_v4t_defconfig (arm, gcc-10) — PASS, 0 errors, 0 warnings, 0 section mismatches -------------------------------------------------------------------------------- multi_v5_defconfig (arm, gcc-10) — PASS, 0 errors, 0 warnings, 0 section mismatches -------------------------------------------------------------------------------- multi_v7_defconfig (arm, gcc-10) — PASS, 0 errors, 0 warnings, 0 section mismatches -------------------------------------------------------------------------------- multi_v7_defconfig+CONFIG_CPU_BIG_ENDIAN=y (arm, gcc-10) — PASS, 0 errors, 0 warnings, 0 section mismatches -------------------------------------------------------------------------------- multi_v7_defconfig+CONFIG_EFI=y+CONFIG_ARM_LPAE=y (arm, gcc-10) — PASS, 0 errors, 0 warnings, 0 section mismatches -------------------------------------------------------------------------------- multi_v7_defconfig+CONFIG_SMP=n (arm, gcc-10) — PASS, 0 errors, 0 warnings, 0 section mismatches -------------------------------------------------------------------------------- multi_v7_defconfig+CONFIG_THUMB2_KERNEL=y (arm, gcc-10) — PASS, 0 errors, 0 warnings, 0 section mismatches -------------------------------------------------------------------------------- multi_v7_defconfig+crypto (arm, gcc-10) — PASS, 0 errors, 0 warnings, 0 section mismatches -------------------------------------------------------------------------------- multi_v7_defconfig+ima (arm, gcc-10) — PASS, 0 errors, 0 warnings, 0 section mismatches -------------------------------------------------------------------------------- multi_v7_defconfig+kselftest (arm, gcc-10) — PASS, 0 errors, 0 warnings, 0 section mismatches -------------------------------------------------------------------------------- mvebu_v5_defconfig (arm, gcc-10) — PASS, 0 errors, 0 warnings, 0 section mismatches -------------------------------------------------------------------------------- mvebu_v7_defconfig (arm, gcc-10) — PASS, 0 errors, 0 warnings, 0 section mismatches -------------------------------------------------------------------------------- mxs_defconfig (arm, gcc-10) — PASS, 0 errors, 0 warnings, 0 section mismatches -------------------------------------------------------------------------------- neponset_defconfig (arm, gcc-10) — PASS, 0 errors, 0 warnings, 0 section mismatches -------------------------------------------------------------------------------- netwinder_defconfig (arm, gcc-10) — PASS, 0 errors, 0 warnings, 0 section mismatches -------------------------------------------------------------------------------- nhk8815_defconfig (arm, gcc-10) — PASS, 0 errors, 0 warnings, 0 section mismatches -------------------------------------------------------------------------------- nlm_xlp_defconfig (mips, gcc-10) — PASS, 0 errors, 0 warnings, 0 section mismatches -------------------------------------------------------------------------------- nlm_xlr_defconfig (mips, gcc-10) — PASS, 0 errors, 0 warnings, 0 section mismatches -------------------------------------------------------------------------------- nommu_k210_defconfig (riscv, gcc-10) — PASS, 0 errors, 0 warnings, 0 section mismatches -------------------------------------------------------------------------------- nommu_k210_sdcard_defconfig (riscv, gcc-10) — PASS, 0 errors, 0 warnings, 0 section mismatches -------------------------------------------------------------------------------- nsimosci_hs_defconfig (arc, gcc-10) — PASS, 0 errors, 0 warnings, 0 section mismatches -------------------------------------------------------------------------------- nsimosci_hs_smp_defconfig (arc, gcc-10) — PASS, 0 errors, 0 warnings, 0 section mismatches -------------------------------------------------------------------------------- omap1_defconfig (arm, gcc-10) — PASS, 0 errors, 0 warnings, 0 section mismatches -------------------------------------------------------------------------------- omap2plus_defconfig (arm, gcc-10) — PASS, 0 errors, 0 warnings, 0 section mismatches -------------------------------------------------------------------------------- omega2p_defconfig (mips, gcc-10) — PASS, 0 errors, 0 warnings, 0 section mismatches -------------------------------------------------------------------------------- orion5x_defconfig (arm, gcc-10) — PASS, 0 errors, 0 warnings, 0 section mismatches -------------------------------------------------------------------------------- oxnas_v6_defconfig (arm, gcc-10) — PASS, 0 errors, 0 warnings, 0 section mismatches -------------------------------------------------------------------------------- palmz72_defconfig (arm, gcc-10) — PASS, 0 errors, 0 warnings, 0 section mismatches -------------------------------------------------------------------------------- pcm027_defconfig (arm, gcc-10) — PASS, 0 errors, 0 warnings, 0 section mismatches -------------------------------------------------------------------------------- pic32mzda_defconfig (mips, gcc-10) — PASS, 0 errors, 0 warnings, 0 section mismatches -------------------------------------------------------------------------------- pleb_defconfig (arm, gcc-10) — PASS, 0 errors, 0 warnings, 0 section mismatches -------------------------------------------------------------------------------- pxa168_defconfig (arm, gcc-10) — PASS, 0 errors, 0 warnings, 0 section mismatches -------------------------------------------------------------------------------- pxa255-idp_defconfig (arm, gcc-10) — PASS, 0 errors, 0 warnings, 0 section mismatches -------------------------------------------------------------------------------- pxa3xx_defconfig (arm, gcc-10) — PASS, 0 errors, 0 warnings, 0 section mismatches -------------------------------------------------------------------------------- pxa910_defconfig (arm, gcc-10) — PASS, 0 errors, 0 warnings, 0 section mismatches -------------------------------------------------------------------------------- pxa_defconfig (arm, gcc-10) — PASS, 0 errors, 0 warnings, 0 section mismatches -------------------------------------------------------------------------------- qcom_defconfig (arm, gcc-10) — PASS, 0 errors, 0 warnings, 0 section mismatches -------------------------------------------------------------------------------- qi_lb60_defconfig (mips, gcc-10) — PASS, 0 errors, 0 warnings, 0 section mismatches -------------------------------------------------------------------------------- rb532_defconfig (mips, gcc-10) — PASS, 0 errors, 0 warnings, 0 section mismatches -------------------------------------------------------------------------------- rbtx49xx_defconfig (mips, gcc-10) — PASS, 0 errors, 1 warning, 0 section mismatches Warnings: drivers/net/ethernet/8390/ne.c:909:20: warning: ‘ne_add_devices’ defined but not used [-Wunused-function] -------------------------------------------------------------------------------- realview_defconfig (arm, gcc-10) — PASS, 0 errors, 0 warnings, 0 section mismatches -------------------------------------------------------------------------------- rm200_defconfig (mips, gcc-10) — PASS, 0 errors, 1 warning, 0 section mismatches Warnings: drivers/block/paride/bpck.c:32: warning: "PC" redefined -------------------------------------------------------------------------------- rpc_defconfig (arm, gcc-10) — FAIL, 4 errors, 0 warnings, 0 section mismatches Errors: arm-linux-gnueabihf-gcc: error: unrecognized -march target: armv3m arm-linux-gnueabihf-gcc: error: missing argument to ‘-march=’ arm-linux-gnueabihf-gcc: error: unrecognized -march target: armv3m arm-linux-gnueabihf-gcc: error: missing argument to ‘-march=’ -------------------------------------------------------------------------------- rs90_defconfig (mips, gcc-10) — PASS, 0 errors, 0 warnings, 0 section mismatches -------------------------------------------------------------------------------- rt305x_defconfig (mips, gcc-10) — PASS, 0 errors, 0 warnings, 0 section mismatches -------------------------------------------------------------------------------- rv32_defconfig (riscv, gcc-10) — PASS, 0 errors, 6 warnings, 0 section mismatches Warnings: <stdin>:834:2: warning: #warning syscall fstat64 not implemented [-Wcpp] <stdin>:1131:2: warning: #warning syscall fstatat64 not implemented [-Wcpp] <stdin>:1515:2: warning: #warning syscall clone3 not implemented [-Wcpp] <stdin>:834:2: warning: #warning syscall fstat64 not implemented [-Wcpp] <stdin>:1131:2: warning: #warning syscall fstatat64 not implemented [-Wcpp] <stdin>:1515:2: warning: #warning syscall clone3 not implemented [-Wcpp] -------------------------------------------------------------------------------- s3c2410_defconfig (arm, gcc-10) — PASS, 0 errors, 0 warnings, 0 section mismatches -------------------------------------------------------------------------------- s3c6400_defconfig (arm, gcc-10) — PASS, 0 errors, 0 warnings, 0 section mismatches -------------------------------------------------------------------------------- s5pv210_defconfig (arm, gcc-10) — PASS, 0 errors, 0 warnings, 0 section mismatches -------------------------------------------------------------------------------- sama5_defconfig (arm, gcc-10) — PASS, 0 errors, 0 warnings, 0 section mismatches -------------------------------------------------------------------------------- sama7_defconfig (arm, gcc-10) — PASS, 0 errors, 0 warnings, 0 section mismatches -------------------------------------------------------------------------------- sb1250_swarm_defconfig (mips, gcc-10) — PASS, 0 errors, 0 warnings, 0 section mismatches -------------------------------------------------------------------------------- shannon_defconfig (arm, gcc-10) — PASS, 0 errors, 0 warnings, 0 section mismatches -------------------------------------------------------------------------------- shmobile_defconfig (arm, gcc-10) — PASS, 0 errors, 0 warnings, 0 section mismatches -------------------------------------------------------------------------------- simpad_defconfig (arm, gcc-10) — PASS, 0 errors, 0 warnings, 0 section mismatches -------------------------------------------------------------------------------- socfpga_defconfig (arm, gcc-10) — PASS, 0 errors, 0 warnings, 0 section mismatches -------------------------------------------------------------------------------- spear13xx_defconfig (arm, gcc-10) — PASS, 0 errors, 0 warnings, 0 section mismatches -------------------------------------------------------------------------------- spear3xx_defconfig (arm, gcc-10) — PASS, 0 errors, 0 warnings, 0 section mismatches -------------------------------------------------------------------------------- spear6xx_defconfig (arm, gcc-10) — PASS, 0 errors, 0 warnings, 0 section mismatches -------------------------------------------------------------------------------- spitz_defconfig (arm, gcc-10) — PASS, 0 errors, 0 warnings, 0 section mismatches -------------------------------------------------------------------------------- stm32_defconfig (arm, gcc-10) — PASS, 0 errors, 0 warnings, 0 section mismatches -------------------------------------------------------------------------------- sunxi_defconfig (arm, gcc-10) — PASS, 0 errors, 0 warnings, 0 section mismatches -------------------------------------------------------------------------------- tb0219_defconfig (mips, gcc-10) — PASS, 0 errors, 0 warnings, 0 section mismatches -------------------------------------------------------------------------------- tb0226_defconfig (mips, gcc-10) — PASS, 0 errors, 0 warnings, 0 section mismatches -------------------------------------------------------------------------------- tb0287_defconfig (mips, gcc-10) — PASS, 0 errors, 0 warnings, 0 section mismatches -------------------------------------------------------------------------------- tct_hammer_defconfig (arm, gcc-10) — PASS, 0 errors, 0 warnings, 0 section mismatches -------------------------------------------------------------------------------- tegra_defconfig (arm, gcc-10) — PASS, 0 errors, 0 warnings, 0 section mismatches -------------------------------------------------------------------------------- tinyconfig (i386, gcc-10) — PASS, 0 errors, 0 warnings, 0 section mismatches -------------------------------------------------------------------------------- tinyconfig (arc, gcc-10) — PASS, 0 errors, 1 warning, 0 section mismatches Warnings: arch/arc/Makefile:26: ** WARNING ** CONFIG_ARC_TUNE_MCPU flag '' is unknown, fallback to '' -------------------------------------------------------------------------------- tinyconfig (x86_64, gcc-10) — PASS, 0 errors, 0 warnings, 0 section mismatches -------------------------------------------------------------------------------- trizeps4_defconfig (arm, gcc-10) — PASS, 0 errors, 0 warnings, 0 section mismatches -------------------------------------------------------------------------------- u8500_defconfig (arm, gcc-10) — PASS, 0 errors, 0 warnings, 0 section mismatches -------------------------------------------------------------------------------- vdk_hs38_defconfig (arc, gcc-10) — PASS, 0 errors, 0 warnings, 0 section mismatches -------------------------------------------------------------------------------- vdk_hs38_smp_defconfig (arc, gcc-10) — PASS, 0 errors, 0 warnings, 0 section mismatches -------------------------------------------------------------------------------- versatile_defconfig (arm, gcc-10) — PASS, 0 errors, 0 warnings, 0 section mismatches -------------------------------------------------------------------------------- vexpress_defconfig (arm, gcc-10) — PASS, 0 errors, 0 warnings, 0 section mismatches -------------------------------------------------------------------------------- vf610m4_defconfig (arm, gcc-10) — PASS, 0 errors, 0 warnings, 0 section mismatches -------------------------------------------------------------------------------- viper_defconfig (arm, gcc-10) — PASS, 0 errors, 0 warnings, 0 section mismatches -------------------------------------------------------------------------------- vocore2_defconfig (mips, gcc-10) — PASS, 0 errors, 0 warnings, 0 section mismatches -------------------------------------------------------------------------------- vt8500_v6_v7_defconfig (arm, gcc-10) — PASS, 0 errors, 0 warnings, 0 section mismatches -------------------------------------------------------------------------------- workpad_defconfig (mips, gcc-10) — PASS, 0 errors, 0 warnings, 0 section mismatches -------------------------------------------------------------------------------- x86_64_defconfig (x86_64, gcc-10) — PASS, 0 errors, 0 warnings, 0 section mismatches -------------------------------------------------------------------------------- x86_64_defconfig+crypto (x86_64, gcc-10) — PASS, 0 errors, 0 warnings, 0 section mismatches -------------------------------------------------------------------------------- x86_64_defconfig+ima (x86_64, gcc-10) — PASS, 0 errors, 0 warnings, 0 section mismatches -------------------------------------------------------------------------------- x86_64_defconfig+kselftest (x86_64, gcc-10) — PASS, 0 errors, 0 warnings, 0 section mismatches -------------------------------------------------------------------------------- x86_64_defconfig+x86-chromebook (x86_64, gcc-10) — PASS, 0 errors, 0 warnings, 0 section mismatches -------------------------------------------------------------------------------- x86_64_defconfig+x86-chromebook+kselftest (x86_64, gcc-10) — PASS, 0 errors, 0 warnings, 0 section mismatches -------------------------------------------------------------------------------- x86_64_defconfig+x86_kvm_guest (x86_64, gcc-10) — PASS, 0 errors, 0 warnings, 0 section mismatches -------------------------------------------------------------------------------- xcep_defconfig (arm, gcc-10) — PASS, 0 errors, 0 warnings, 0 section mismatches -------------------------------------------------------------------------------- zeus_defconfig (arm, gcc-10) — PASS, 0 errors, 0 warnings, 0 section mismatches --- For more info write to <info(a)kernelci.org>
3 years, 4 months
1
0
0
0
mainline/master build: 210 builds: 14 failed, 196 passed, 109 errors, 22 warnings (v5.15-rc7-18-gd25f27432f80)
by kernelci.org bot
mainline/master build: 210 builds: 14 failed, 196 passed, 109 errors, 22 warnings (v5.15-rc7-18-gd25f27432f80) Full Build Summary:
https://kernelci.org/build/mainline/branch/master/kernel/v5.15-rc7-18-gd25f…
Tree: mainline Branch: master Git Describe: v5.15-rc7-18-gd25f27432f80 Git Commit: d25f27432f80a800a3592db128254c8140bd71bf Git URL:
https://git.kernel.org/pub/scm/linux/kernel/git/torvalds/linux.git
Built: 7 unique architectures Build Failures Detected: arm64: allmodconfig: (clang-10) FAIL defconfig: (clang-10) FAIL defconfig+CONFIG_ARM64_64K_PAGES=y: (clang-10) FAIL arm: allnoconfig: (clang-10) FAIL aspeed_g5_defconfig: (clang-10) FAIL multi_v7_defconfig: (clang-10) FAIL rpc_defconfig: (gcc-10) FAIL i386: allmodconfig: (clang-10) FAIL mips: decstation_64_defconfig: (gcc-10) FAIL ip27_defconfig: (gcc-10) FAIL ip28_defconfig: (gcc-10) FAIL lemote2f_defconfig: (gcc-10) FAIL x86_64: allmodconfig: (clang-10) FAIL x86_64_defconfig: (clang-10) FAIL Errors and Warnings Detected: arc: haps_hs_smp_defconfig+kselftest (gcc-10): 3 warnings tinyconfig (gcc-10): 1 warning arm64: allmodconfig (clang-10): 25 errors defconfig (clang-10): 25 errors defconfig+CONFIG_ARM64_64K_PAGES=y (clang-10): 25 errors arm: allnoconfig (clang-10): 1 error aspeed_g5_defconfig (clang-10): 23 errors, 8 warnings multi_v7_defconfig (clang-10): 2 errors rpc_defconfig (gcc-10): 4 errors i386: allmodconfig (clang-10): 2 errors mips: 32r2el_defconfig (gcc-10): 1 warning 32r2el_defconfig+kselftest (gcc-10): 1 warning lemote2f_defconfig (gcc-10): 1 warning loongson2k_defconfig (gcc-10): 1 warning rm200_defconfig (gcc-10): 1 warning riscv: x86_64: allmodconfig (clang-10): 1 error, 2 warnings allnoconfig (clang-10): 3 warnings x86_64_defconfig (clang-10): 1 error Errors summary: 3 arch/arm64/kvm/hyp/nvhe/hyp-reloc.S:7:11: error: unknown relocation name 3 arch/arm64/kvm/hyp/nvhe/hyp-reloc.S:5:11: error: unknown relocation name 3 arch/arm64/kvm/hyp/nvhe/hyp-reloc.S:55:12: error: unknown relocation name 3 arch/arm64/kvm/hyp/nvhe/hyp-reloc.S:53:12: error: unknown relocation name 3 arch/arm64/kvm/hyp/nvhe/hyp-reloc.S:51:12: error: unknown relocation name 3 arch/arm64/kvm/hyp/nvhe/hyp-reloc.S:49:12: error: unknown relocation name 3 arch/arm64/kvm/hyp/nvhe/hyp-reloc.S:47:12: error: unknown relocation name 3 arch/arm64/kvm/hyp/nvhe/hyp-reloc.S:45:12: error: unknown relocation name 3 arch/arm64/kvm/hyp/nvhe/hyp-reloc.S:43:12: error: unknown relocation name 3 arch/arm64/kvm/hyp/nvhe/hyp-reloc.S:41:12: error: unknown relocation name 3 arch/arm64/kvm/hyp/nvhe/hyp-reloc.S:39:12: error: unknown relocation name 3 arch/arm64/kvm/hyp/nvhe/hyp-reloc.S:37:12: error: unknown relocation name 3 arch/arm64/kvm/hyp/nvhe/hyp-reloc.S:35:12: error: unknown relocation name 3 arch/arm64/kvm/hyp/nvhe/hyp-reloc.S:33:12: error: unknown relocation name 3 arch/arm64/kvm/hyp/nvhe/hyp-reloc.S:31:12: error: unknown relocation name 3 arch/arm64/kvm/hyp/nvhe/hyp-reloc.S:29:12: error: unknown relocation name 3 arch/arm64/kvm/hyp/nvhe/hyp-reloc.S:27:12: error: unknown relocation name 3 arch/arm64/kvm/hyp/nvhe/hyp-reloc.S:25:12: error: unknown relocation name 3 arch/arm64/kvm/hyp/nvhe/hyp-reloc.S:23:12: error: unknown relocation name 3 arch/arm64/kvm/hyp/nvhe/hyp-reloc.S:21:12: error: unknown relocation name 3 arch/arm64/kvm/hyp/nvhe/hyp-reloc.S:19:12: error: unknown relocation name 3 arch/arm64/kvm/hyp/nvhe/hyp-reloc.S:17:12: error: unknown relocation name 3 arch/arm64/kvm/hyp/nvhe/hyp-reloc.S:15:12: error: unknown relocation name 3 arch/arm64/kvm/hyp/nvhe/hyp-reloc.S:12:12: error: unknown relocation name 3 arch/arm64/kvm/hyp/nvhe/hyp-reloc.S:10:11: error: unknown relocation name 2 arm-linux-gnueabihf-gcc: error: unrecognized -march target: armv3m 2 arm-linux-gnueabihf-gcc: error: missing argument to ‘-march=’ 2 arch/arm/kernel/entry-armv.S:504:4: error: invalid instruction, any one of the following would fix this: 2 arch/arm/kernel/entry-armv.S:500:4: error: invalid instruction, any one of the following would fix this: 2 <instantiation>:2:2: error: unknown use of instruction mnemonic without a size suffix 1 drivers/staging/media/hantro/hantro_g2_hevc_dec.c:536:5: error: stack frame size of 1228 bytes in function 'hantro_g2_hevc_dec_run' [-Werror,-Wframe-larger-than=] 1 drivers/gpu/drm/amd/amdgpu/../display/dc/calcs/dcn_calcs.c:452:13: error: stack frame size of 1580 bytes in function 'dcn_bw_calc_rq_dlg_ttu' [-Werror,-Wframe-larger-than=] 1 clang: error: unsupported argument '-mimplicit-it=always' to option 'Wa,' 1 arch/arm/mm/cache-v7.S:97:2: error: instruction requires: data-barriers 1 arch/arm/mm/cache-v7.S:69:2: error: instruction requires: data-barriers 1 arch/arm/mm/cache-v7.S:68:4: error: invalid instruction 1 arch/arm/mm/cache-v7.S:56:4: error: instruction requires: armv6t2 1 arch/arm/mm/cache-v7.S:45:2: error: instruction requires: armv6t2 1 arch/arm/mm/cache-v7.S:431:2: error: invalid instruction 1 arch/arm/mm/cache-v7.S:42:2: error: instruction requires: data-barriers 1 arch/arm/mm/cache-v7.S:409:2: error: invalid instruction 1 arch/arm/mm/cache-v7.S:387:2: error: invalid instruction 1 arch/arm/mm/cache-v7.S:352:2: error: invalid instruction 1 arch/arm/mm/cache-v7.S:312:2: error: instruction requires: data-barriers 1 arch/arm/mm/cache-v7.S:311:2: error: invalid instruction 1 arch/arm/mm/cache-v7.S:294:2: error: invalid instruction 1 arch/arm/mm/cache-v7.S:179:2: error: instruction requires: data-barriers 1 arch/arm/mm/cache-v7.S:178:2: error: invalid instruction 1 arch/arm/mm/cache-v7.S:152:2: error: instruction requires: armv6t2 1 arch/arm/mm/cache-v7.S:149:2: error: instruction requires: armv6t2 1 arch/arm/mm/cache-v7.S:142:2: error: instruction requires: data-barriers 1 arch/arm/mm/cache-v7.S:125:2: error: instruction requires: data-barriers 1 arch/arm/mm/cache-v7.S:107:2: error: instruction requires: armv6t2 1 arch/arm/mm/cache-v7.S:106:2: error: instruction requires: armv6t2 Warnings summary: 4 clang: warning: argument unused during compilation: '-march=armv6k' [-Wunused-command-line-argument] 2 net/mac80211/mlme.c:4345:1: warning: the frame size of 1200 bytes is larger than 1024 bytes [-Wframe-larger-than=] 2 clang: warning: argument unused during compilation: '-Wa,-march=armv7-a' [-Wunused-command-line-argument] 2 arch/x86/lib/memset_64.o: warning: objtool: memset_erms(): can't find starting instruction 2 arch/x86/lib/memcpy_64.o: warning: objtool: memcpy_erms(): can't find starting instruction 2 arch/mips/boot/dts/img/boston.dts:128.19-178.5: Warning (pci_device_reg): /pci@14000000/pci2_root@0,0,0: PCI unit address format error, expected "0,0" 2 arch/arc/Makefile:26: ** WARNING ** CONFIG_ARC_TUNE_MCPU flag '' is unknown, fallback to '' 1 drivers/block/paride/bpck.c:32: warning: "PC" redefined 1 clang: warning: argument unused during compilation: '-Wa,-march=armv6k' [-Wunused-command-line-argument] 1 clang: warning: argument unused during compilation: '-Wa,-march=armv6' [-Wunused-command-line-argument] 1 arch/x86/entry/entry_64.o: warning: objtool: asm_load_gs_index(): can't find starting instruction 1 arch/arc/include/asm/perf_event.h:91:27: warning: 'arc_pmu_ev_hw_map' defined but not used [-Wunused-const-variable=] 1 arch/arc/include/asm/perf_event.h:126:27: warning: 'arc_pmu_cache_map' defined but not used [-Wunused-const-variable=] ================================================================================ Detailed per-defconfig build reports: -------------------------------------------------------------------------------- 32r2el_defconfig (mips, gcc-10) — PASS, 0 errors, 1 warning, 0 section mismatches Warnings: arch/mips/boot/dts/img/boston.dts:128.19-178.5: Warning (pci_device_reg): /pci@14000000/pci2_root@0,0,0: PCI unit address format error, expected "0,0" -------------------------------------------------------------------------------- 32r2el_defconfig+kselftest (mips, gcc-10) — PASS, 0 errors, 1 warning, 0 section mismatches Warnings: arch/mips/boot/dts/img/boston.dts:128.19-178.5: Warning (pci_device_reg): /pci@14000000/pci2_root@0,0,0: PCI unit address format error, expected "0,0" -------------------------------------------------------------------------------- allmodconfig (arm, gcc-10) — PASS, 0 errors, 0 warnings, 0 section mismatches -------------------------------------------------------------------------------- allmodconfig (x86_64, clang-10) — FAIL, 1 error, 2 warnings, 0 section mismatches Errors: <instantiation>:2:2: error: unknown use of instruction mnemonic without a size suffix Warnings: arch/x86/lib/memcpy_64.o: warning: objtool: memcpy_erms(): can't find starting instruction arch/x86/lib/memset_64.o: warning: objtool: memset_erms(): can't find starting instruction -------------------------------------------------------------------------------- allmodconfig (arm64, clang-10) — FAIL, 25 errors, 0 warnings, 0 section mismatches Errors: arch/arm64/kvm/hyp/nvhe/hyp-reloc.S:5:11: error: unknown relocation name arch/arm64/kvm/hyp/nvhe/hyp-reloc.S:7:11: error: unknown relocation name arch/arm64/kvm/hyp/nvhe/hyp-reloc.S:10:11: error: unknown relocation name arch/arm64/kvm/hyp/nvhe/hyp-reloc.S:12:12: error: unknown relocation name arch/arm64/kvm/hyp/nvhe/hyp-reloc.S:15:12: error: unknown relocation name arch/arm64/kvm/hyp/nvhe/hyp-reloc.S:17:12: error: unknown relocation name arch/arm64/kvm/hyp/nvhe/hyp-reloc.S:19:12: error: unknown relocation name arch/arm64/kvm/hyp/nvhe/hyp-reloc.S:21:12: error: unknown relocation name arch/arm64/kvm/hyp/nvhe/hyp-reloc.S:23:12: error: unknown relocation name arch/arm64/kvm/hyp/nvhe/hyp-reloc.S:25:12: error: unknown relocation name arch/arm64/kvm/hyp/nvhe/hyp-reloc.S:27:12: error: unknown relocation name arch/arm64/kvm/hyp/nvhe/hyp-reloc.S:29:12: error: unknown relocation name arch/arm64/kvm/hyp/nvhe/hyp-reloc.S:31:12: error: unknown relocation name arch/arm64/kvm/hyp/nvhe/hyp-reloc.S:33:12: error: unknown relocation name arch/arm64/kvm/hyp/nvhe/hyp-reloc.S:35:12: error: unknown relocation name arch/arm64/kvm/hyp/nvhe/hyp-reloc.S:37:12: error: unknown relocation name arch/arm64/kvm/hyp/nvhe/hyp-reloc.S:39:12: error: unknown relocation name arch/arm64/kvm/hyp/nvhe/hyp-reloc.S:41:12: error: unknown relocation name arch/arm64/kvm/hyp/nvhe/hyp-reloc.S:43:12: error: unknown relocation name arch/arm64/kvm/hyp/nvhe/hyp-reloc.S:45:12: error: unknown relocation name arch/arm64/kvm/hyp/nvhe/hyp-reloc.S:47:12: error: unknown relocation name arch/arm64/kvm/hyp/nvhe/hyp-reloc.S:49:12: error: unknown relocation name arch/arm64/kvm/hyp/nvhe/hyp-reloc.S:51:12: error: unknown relocation name arch/arm64/kvm/hyp/nvhe/hyp-reloc.S:53:12: error: unknown relocation name arch/arm64/kvm/hyp/nvhe/hyp-reloc.S:55:12: error: unknown relocation name -------------------------------------------------------------------------------- allmodconfig (i386, clang-10) — FAIL, 2 errors, 0 warnings, 0 section mismatches Errors: drivers/gpu/drm/amd/amdgpu/../display/dc/calcs/dcn_calcs.c:452:13: error: stack frame size of 1580 bytes in function 'dcn_bw_calc_rq_dlg_ttu' [-Werror,-Wframe-larger-than=] drivers/staging/media/hantro/hantro_g2_hevc_dec.c:536:5: error: stack frame size of 1228 bytes in function 'hantro_g2_hevc_dec_run' [-Werror,-Wframe-larger-than=] -------------------------------------------------------------------------------- allmodconfig (arm64, gcc-10) — PASS, 0 errors, 0 warnings, 0 section mismatches -------------------------------------------------------------------------------- allnoconfig (i386, gcc-10) — PASS, 0 errors, 0 warnings, 0 section mismatches -------------------------------------------------------------------------------- allnoconfig (i386, clang-10) — PASS, 0 errors, 0 warnings, 0 section mismatches -------------------------------------------------------------------------------- allnoconfig (x86_64, clang-10) — PASS, 0 errors, 3 warnings, 0 section mismatches Warnings: arch/x86/entry/entry_64.o: warning: objtool: asm_load_gs_index(): can't find starting instruction arch/x86/lib/memcpy_64.o: warning: objtool: memcpy_erms(): can't find starting instruction arch/x86/lib/memset_64.o: warning: objtool: memset_erms(): can't find starting instruction -------------------------------------------------------------------------------- allnoconfig (arm, clang-10) — FAIL, 1 error, 0 warnings, 0 section mismatches Errors: clang: error: unsupported argument '-mimplicit-it=always' to option 'Wa,' -------------------------------------------------------------------------------- allnoconfig (x86_64, gcc-10) — PASS, 0 errors, 0 warnings, 0 section mismatches -------------------------------------------------------------------------------- allnoconfig (arc, gcc-10) — PASS, 0 errors, 0 warnings, 0 section mismatches -------------------------------------------------------------------------------- am200epdkit_defconfig (arm, gcc-10) — PASS, 0 errors, 0 warnings, 0 section mismatches -------------------------------------------------------------------------------- ar7_defconfig (mips, gcc-10) — PASS, 0 errors, 0 warnings, 0 section mismatches -------------------------------------------------------------------------------- aspeed_g4_defconfig (arm, gcc-10) — PASS, 0 errors, 0 warnings, 0 section mismatches -------------------------------------------------------------------------------- aspeed_g5_defconfig (arm, gcc-10) — PASS, 0 errors, 0 warnings, 0 section mismatches -------------------------------------------------------------------------------- aspeed_g5_defconfig (arm, clang-10) — FAIL, 23 errors, 8 warnings, 0 section mismatches Errors: arch/arm/kernel/entry-armv.S:500:4: error: invalid instruction, any one of the following would fix this: arch/arm/kernel/entry-armv.S:504:4: error: invalid instruction, any one of the following would fix this: arch/arm/mm/cache-v7.S:42:2: error: instruction requires: data-barriers arch/arm/mm/cache-v7.S:45:2: error: instruction requires: armv6t2 arch/arm/mm/cache-v7.S:56:4: error: instruction requires: armv6t2 arch/arm/mm/cache-v7.S:68:4: error: invalid instruction arch/arm/mm/cache-v7.S:69:2: error: instruction requires: data-barriers arch/arm/mm/cache-v7.S:97:2: error: instruction requires: data-barriers arch/arm/mm/cache-v7.S:106:2: error: instruction requires: armv6t2 arch/arm/mm/cache-v7.S:107:2: error: instruction requires: armv6t2 arch/arm/mm/cache-v7.S:125:2: error: instruction requires: data-barriers arch/arm/mm/cache-v7.S:142:2: error: instruction requires: data-barriers arch/arm/mm/cache-v7.S:149:2: error: instruction requires: armv6t2 arch/arm/mm/cache-v7.S:152:2: error: instruction requires: armv6t2 arch/arm/mm/cache-v7.S:178:2: error: invalid instruction arch/arm/mm/cache-v7.S:179:2: error: instruction requires: data-barriers arch/arm/mm/cache-v7.S:294:2: error: invalid instruction arch/arm/mm/cache-v7.S:311:2: error: invalid instruction arch/arm/mm/cache-v7.S:312:2: error: instruction requires: data-barriers arch/arm/mm/cache-v7.S:352:2: error: invalid instruction arch/arm/mm/cache-v7.S:387:2: error: invalid instruction arch/arm/mm/cache-v7.S:409:2: error: invalid instruction arch/arm/mm/cache-v7.S:431:2: error: invalid instruction Warnings: clang: warning: argument unused during compilation: '-march=armv6k' [-Wunused-command-line-argument] clang: warning: argument unused during compilation: '-Wa,-march=armv6k' [-Wunused-command-line-argument] clang: warning: argument unused during compilation: '-march=armv6k' [-Wunused-command-line-argument] clang: warning: argument unused during compilation: '-Wa,-march=armv7-a' [-Wunused-command-line-argument] clang: warning: argument unused during compilation: '-march=armv6k' [-Wunused-command-line-argument] clang: warning: argument unused during compilation: '-Wa,-march=armv6' [-Wunused-command-line-argument] clang: warning: argument unused during compilation: '-march=armv6k' [-Wunused-command-line-argument] clang: warning: argument unused during compilation: '-Wa,-march=armv7-a' [-Wunused-command-line-argument] -------------------------------------------------------------------------------- assabet_defconfig (arm, gcc-10) — PASS, 0 errors, 0 warnings, 0 section mismatches -------------------------------------------------------------------------------- at91_dt_defconfig (arm, gcc-10) — PASS, 0 errors, 0 warnings, 0 section mismatches -------------------------------------------------------------------------------- ath25_defconfig (mips, gcc-10) — PASS, 0 errors, 0 warnings, 0 section mismatches -------------------------------------------------------------------------------- ath79_defconfig (mips, gcc-10) — PASS, 0 errors, 0 warnings, 0 section mismatches -------------------------------------------------------------------------------- axm55xx_defconfig (arm, gcc-10) — PASS, 0 errors, 0 warnings, 0 section mismatches -------------------------------------------------------------------------------- axs103_defconfig (arc, gcc-10) — PASS, 0 errors, 0 warnings, 0 section mismatches -------------------------------------------------------------------------------- axs103_smp_defconfig (arc, gcc-10) — PASS, 0 errors, 0 warnings, 0 section mismatches -------------------------------------------------------------------------------- badge4_defconfig (arm, gcc-10) — PASS, 0 errors, 0 warnings, 0 section mismatches -------------------------------------------------------------------------------- bcm2835_defconfig (arm, gcc-10) — PASS, 0 errors, 0 warnings, 0 section mismatches -------------------------------------------------------------------------------- bcm47xx_defconfig (mips, gcc-10) — PASS, 0 errors, 0 warnings, 0 section mismatches -------------------------------------------------------------------------------- bcm63xx_defconfig (mips, gcc-10) — PASS, 0 errors, 0 warnings, 0 section mismatches -------------------------------------------------------------------------------- bigsur_defconfig (mips, gcc-10) — PASS, 0 errors, 0 warnings, 0 section mismatches -------------------------------------------------------------------------------- bmips_be_defconfig (mips, gcc-10) — PASS, 0 errors, 0 warnings, 0 section mismatches -------------------------------------------------------------------------------- bmips_stb_defconfig (mips, gcc-10) — PASS, 0 errors, 0 warnings, 0 section mismatches -------------------------------------------------------------------------------- capcella_defconfig (mips, gcc-10) — PASS, 0 errors, 0 warnings, 0 section mismatches -------------------------------------------------------------------------------- cavium_octeon_defconfig (mips, gcc-10) — PASS, 0 errors, 0 warnings, 0 section mismatches -------------------------------------------------------------------------------- ci20_defconfig (mips, gcc-10) — PASS, 0 errors, 0 warnings, 0 section mismatches -------------------------------------------------------------------------------- cm_x300_defconfig (arm, gcc-10) — PASS, 0 errors, 0 warnings, 0 section mismatches -------------------------------------------------------------------------------- cobalt_defconfig (mips, gcc-10) — PASS, 0 errors, 0 warnings, 0 section mismatches -------------------------------------------------------------------------------- colibri_pxa270_defconfig (arm, gcc-10) — PASS, 0 errors, 0 warnings, 0 section mismatches -------------------------------------------------------------------------------- colibri_pxa300_defconfig (arm, gcc-10) — PASS, 0 errors, 0 warnings, 0 section mismatches -------------------------------------------------------------------------------- collie_defconfig (arm, gcc-10) — PASS, 0 errors, 0 warnings, 0 section mismatches -------------------------------------------------------------------------------- corgi_defconfig (arm, gcc-10) — PASS, 0 errors, 0 warnings, 0 section mismatches -------------------------------------------------------------------------------- cu1000-neo_defconfig (mips, gcc-10) — PASS, 0 errors, 0 warnings, 0 section mismatches -------------------------------------------------------------------------------- cu1830-neo_defconfig (mips, gcc-10) — PASS, 0 errors, 0 warnings, 0 section mismatches -------------------------------------------------------------------------------- davinci_all_defconfig (arm, gcc-10) — PASS, 0 errors, 0 warnings, 0 section mismatches -------------------------------------------------------------------------------- db1xxx_defconfig (mips, gcc-10) — PASS, 0 errors, 0 warnings, 0 section mismatches -------------------------------------------------------------------------------- decstation_64_defconfig (mips, gcc-10) — FAIL, 0 errors, 0 warnings, 0 section mismatches -------------------------------------------------------------------------------- decstation_defconfig (mips, gcc-10) — PASS, 0 errors, 0 warnings, 0 section mismatches -------------------------------------------------------------------------------- decstation_r4k_defconfig (mips, gcc-10) — PASS, 0 errors, 0 warnings, 0 section mismatches -------------------------------------------------------------------------------- defconfig (arm64, clang-10) — FAIL, 25 errors, 0 warnings, 0 section mismatches Errors: arch/arm64/kvm/hyp/nvhe/hyp-reloc.S:5:11: error: unknown relocation name arch/arm64/kvm/hyp/nvhe/hyp-reloc.S:7:11: error: unknown relocation name arch/arm64/kvm/hyp/nvhe/hyp-reloc.S:10:11: error: unknown relocation name arch/arm64/kvm/hyp/nvhe/hyp-reloc.S:12:12: error: unknown relocation name arch/arm64/kvm/hyp/nvhe/hyp-reloc.S:15:12: error: unknown relocation name arch/arm64/kvm/hyp/nvhe/hyp-reloc.S:17:12: error: unknown relocation name arch/arm64/kvm/hyp/nvhe/hyp-reloc.S:19:12: error: unknown relocation name arch/arm64/kvm/hyp/nvhe/hyp-reloc.S:21:12: error: unknown relocation name arch/arm64/kvm/hyp/nvhe/hyp-reloc.S:23:12: error: unknown relocation name arch/arm64/kvm/hyp/nvhe/hyp-reloc.S:25:12: error: unknown relocation name arch/arm64/kvm/hyp/nvhe/hyp-reloc.S:27:12: error: unknown relocation name arch/arm64/kvm/hyp/nvhe/hyp-reloc.S:29:12: error: unknown relocation name arch/arm64/kvm/hyp/nvhe/hyp-reloc.S:31:12: error: unknown relocation name arch/arm64/kvm/hyp/nvhe/hyp-reloc.S:33:12: error: unknown relocation name arch/arm64/kvm/hyp/nvhe/hyp-reloc.S:35:12: error: unknown relocation name arch/arm64/kvm/hyp/nvhe/hyp-reloc.S:37:12: error: unknown relocation name arch/arm64/kvm/hyp/nvhe/hyp-reloc.S:39:12: error: unknown relocation name arch/arm64/kvm/hyp/nvhe/hyp-reloc.S:41:12: error: unknown relocation name arch/arm64/kvm/hyp/nvhe/hyp-reloc.S:43:12: error: unknown relocation name arch/arm64/kvm/hyp/nvhe/hyp-reloc.S:45:12: error: unknown relocation name arch/arm64/kvm/hyp/nvhe/hyp-reloc.S:47:12: error: unknown relocation name arch/arm64/kvm/hyp/nvhe/hyp-reloc.S:49:12: error: unknown relocation name arch/arm64/kvm/hyp/nvhe/hyp-reloc.S:51:12: error: unknown relocation name arch/arm64/kvm/hyp/nvhe/hyp-reloc.S:53:12: error: unknown relocation name arch/arm64/kvm/hyp/nvhe/hyp-reloc.S:55:12: error: unknown relocation name -------------------------------------------------------------------------------- defconfig (riscv, gcc-10) — PASS, 0 errors, 0 warnings, 0 section mismatches -------------------------------------------------------------------------------- defconfig (arm64, gcc-10) — PASS, 0 errors, 0 warnings, 0 section mismatches -------------------------------------------------------------------------------- defconfig+CONFIG_ARM64_64K_PAGES=y (arm64, clang-10) — FAIL, 25 errors, 0 warnings, 0 section mismatches Errors: arch/arm64/kvm/hyp/nvhe/hyp-reloc.S:5:11: error: unknown relocation name arch/arm64/kvm/hyp/nvhe/hyp-reloc.S:7:11: error: unknown relocation name arch/arm64/kvm/hyp/nvhe/hyp-reloc.S:10:11: error: unknown relocation name arch/arm64/kvm/hyp/nvhe/hyp-reloc.S:12:12: error: unknown relocation name arch/arm64/kvm/hyp/nvhe/hyp-reloc.S:15:12: error: unknown relocation name arch/arm64/kvm/hyp/nvhe/hyp-reloc.S:17:12: error: unknown relocation name arch/arm64/kvm/hyp/nvhe/hyp-reloc.S:19:12: error: unknown relocation name arch/arm64/kvm/hyp/nvhe/hyp-reloc.S:21:12: error: unknown relocation name arch/arm64/kvm/hyp/nvhe/hyp-reloc.S:23:12: error: unknown relocation name arch/arm64/kvm/hyp/nvhe/hyp-reloc.S:25:12: error: unknown relocation name arch/arm64/kvm/hyp/nvhe/hyp-reloc.S:27:12: error: unknown relocation name arch/arm64/kvm/hyp/nvhe/hyp-reloc.S:29:12: error: unknown relocation name arch/arm64/kvm/hyp/nvhe/hyp-reloc.S:31:12: error: unknown relocation name arch/arm64/kvm/hyp/nvhe/hyp-reloc.S:33:12: error: unknown relocation name arch/arm64/kvm/hyp/nvhe/hyp-reloc.S:35:12: error: unknown relocation name arch/arm64/kvm/hyp/nvhe/hyp-reloc.S:37:12: error: unknown relocation name arch/arm64/kvm/hyp/nvhe/hyp-reloc.S:39:12: error: unknown relocation name arch/arm64/kvm/hyp/nvhe/hyp-reloc.S:41:12: error: unknown relocation name arch/arm64/kvm/hyp/nvhe/hyp-reloc.S:43:12: error: unknown relocation name arch/arm64/kvm/hyp/nvhe/hyp-reloc.S:45:12: error: unknown relocation name arch/arm64/kvm/hyp/nvhe/hyp-reloc.S:47:12: error: unknown relocation name arch/arm64/kvm/hyp/nvhe/hyp-reloc.S:49:12: error: unknown relocation name arch/arm64/kvm/hyp/nvhe/hyp-reloc.S:51:12: error: unknown relocation name arch/arm64/kvm/hyp/nvhe/hyp-reloc.S:53:12: error: unknown relocation name arch/arm64/kvm/hyp/nvhe/hyp-reloc.S:55:12: error: unknown relocation name -------------------------------------------------------------------------------- defconfig+CONFIG_CPU_BIG_ENDIAN=y (arm64, gcc-10) — PASS, 0 errors, 0 warnings, 0 section mismatches -------------------------------------------------------------------------------- defconfig+crypto (arm64, gcc-10) — PASS, 0 errors, 0 warnings, 0 section mismatches -------------------------------------------------------------------------------- defconfig+ima (arm64, gcc-10) — PASS, 0 errors, 0 warnings, 0 section mismatches -------------------------------------------------------------------------------- defconfig+kselftest (riscv, gcc-10) — PASS, 0 errors, 0 warnings, 0 section mismatches -------------------------------------------------------------------------------- defconfig+kselftest (arm64, gcc-10) — PASS, 0 errors, 0 warnings, 0 section mismatches -------------------------------------------------------------------------------- dove_defconfig (arm, gcc-10) — PASS, 0 errors, 0 warnings, 0 section mismatches -------------------------------------------------------------------------------- e55_defconfig (mips, gcc-10) — PASS, 0 errors, 0 warnings, 0 section mismatches -------------------------------------------------------------------------------- ep93xx_defconfig (arm, gcc-10) — PASS, 0 errors, 0 warnings, 0 section mismatches -------------------------------------------------------------------------------- eseries_pxa_defconfig (arm, gcc-10) — PASS, 0 errors, 0 warnings, 0 section mismatches -------------------------------------------------------------------------------- exynos_defconfig (arm, gcc-10) — PASS, 0 errors, 0 warnings, 0 section mismatches -------------------------------------------------------------------------------- ezx_defconfig (arm, gcc-10) — PASS, 0 errors, 0 warnings, 0 section mismatches -------------------------------------------------------------------------------- footbridge_defconfig (arm, gcc-10) — PASS, 0 errors, 0 warnings, 0 section mismatches -------------------------------------------------------------------------------- fuloong2e_defconfig (mips, gcc-10) — PASS, 0 errors, 0 warnings, 0 section mismatches -------------------------------------------------------------------------------- gcw0_defconfig (mips, gcc-10) — PASS, 0 errors, 0 warnings, 0 section mismatches -------------------------------------------------------------------------------- gemini_defconfig (arm, gcc-10) — PASS, 0 errors, 0 warnings, 0 section mismatches -------------------------------------------------------------------------------- gpr_defconfig (mips, gcc-10) — PASS, 0 errors, 0 warnings, 0 section mismatches -------------------------------------------------------------------------------- h3600_defconfig (arm, gcc-10) — PASS, 0 errors, 0 warnings, 0 section mismatches -------------------------------------------------------------------------------- h5000_defconfig (arm, gcc-10) — PASS, 0 errors, 0 warnings, 0 section mismatches -------------------------------------------------------------------------------- hackkit_defconfig (arm, gcc-10) — PASS, 0 errors, 0 warnings, 0 section mismatches -------------------------------------------------------------------------------- haps_hs_defconfig (arc, gcc-10) — PASS, 0 errors, 0 warnings, 0 section mismatches -------------------------------------------------------------------------------- haps_hs_smp_defconfig (arc, gcc-10) — PASS, 0 errors, 0 warnings, 0 section mismatches -------------------------------------------------------------------------------- haps_hs_smp_defconfig+kselftest (arc, gcc-10) — PASS, 0 errors, 3 warnings, 0 section mismatches Warnings: arch/arc/Makefile:26: ** WARNING ** CONFIG_ARC_TUNE_MCPU flag '' is unknown, fallback to '' arch/arc/include/asm/perf_event.h:126:27: warning: 'arc_pmu_cache_map' defined but not used [-Wunused-const-variable=] arch/arc/include/asm/perf_event.h:91:27: warning: 'arc_pmu_ev_hw_map' defined but not used [-Wunused-const-variable=] -------------------------------------------------------------------------------- hisi_defconfig (arm, gcc-10) — PASS, 0 errors, 0 warnings, 0 section mismatches -------------------------------------------------------------------------------- hsdk_defconfig (arc, gcc-10) — PASS, 0 errors, 0 warnings, 0 section mismatches -------------------------------------------------------------------------------- i386_defconfig (i386, gcc-10) — PASS, 0 errors, 0 warnings, 0 section mismatches -------------------------------------------------------------------------------- i386_defconfig (i386, clang-10) — PASS, 0 errors, 0 warnings, 0 section mismatches -------------------------------------------------------------------------------- i386_defconfig+kselftest (i386, gcc-10) — PASS, 0 errors, 0 warnings, 0 section mismatches -------------------------------------------------------------------------------- imote2_defconfig (arm, gcc-10) — PASS, 0 errors, 0 warnings, 0 section mismatches -------------------------------------------------------------------------------- imx_v4_v5_defconfig (arm, gcc-10) — PASS, 0 errors, 0 warnings, 0 section mismatches -------------------------------------------------------------------------------- imx_v6_v7_defconfig (arm, gcc-10) — PASS, 0 errors, 0 warnings, 0 section mismatches -------------------------------------------------------------------------------- integrator_defconfig (arm, gcc-10) — PASS, 0 errors, 0 warnings, 0 section mismatches -------------------------------------------------------------------------------- iop32x_defconfig (arm, gcc-10) — PASS, 0 errors, 0 warnings, 0 section mismatches -------------------------------------------------------------------------------- ip22_defconfig (mips, gcc-10) — PASS, 0 errors, 0 warnings, 0 section mismatches -------------------------------------------------------------------------------- ip27_defconfig (mips, gcc-10) — FAIL, 0 errors, 0 warnings, 0 section mismatches -------------------------------------------------------------------------------- ip28_defconfig (mips, gcc-10) — FAIL, 0 errors, 0 warnings, 0 section mismatches -------------------------------------------------------------------------------- ip32_defconfig (mips, gcc-10) — PASS, 0 errors, 0 warnings, 0 section mismatches -------------------------------------------------------------------------------- ixp4xx_defconfig (arm, gcc-10) — PASS, 0 errors, 0 warnings, 0 section mismatches -------------------------------------------------------------------------------- jazz_defconfig (mips, gcc-10) — PASS, 0 errors, 0 warnings, 0 section mismatches -------------------------------------------------------------------------------- jmr3927_defconfig (mips, gcc-10) — PASS, 0 errors, 0 warnings, 0 section mismatches -------------------------------------------------------------------------------- jornada720_defconfig (arm, gcc-10) — PASS, 0 errors, 0 warnings, 0 section mismatches -------------------------------------------------------------------------------- keystone_defconfig (arm, gcc-10) — PASS, 0 errors, 0 warnings, 0 section mismatches -------------------------------------------------------------------------------- lart_defconfig (arm, gcc-10) — PASS, 0 errors, 0 warnings, 0 section mismatches -------------------------------------------------------------------------------- lemote2f_defconfig (mips, gcc-10) — FAIL, 0 errors, 1 warning, 0 section mismatches Warnings: net/mac80211/mlme.c:4345:1: warning: the frame size of 1200 bytes is larger than 1024 bytes [-Wframe-larger-than=] -------------------------------------------------------------------------------- loongson1b_defconfig (mips, gcc-10) — PASS, 0 errors, 0 warnings, 0 section mismatches -------------------------------------------------------------------------------- loongson1c_defconfig (mips, gcc-10) — PASS, 0 errors, 0 warnings, 0 section mismatches -------------------------------------------------------------------------------- loongson2k_defconfig (mips, gcc-10) — PASS, 0 errors, 1 warning, 0 section mismatches Warnings: net/mac80211/mlme.c:4345:1: warning: the frame size of 1200 bytes is larger than 1024 bytes [-Wframe-larger-than=] -------------------------------------------------------------------------------- loongson3_defconfig (mips, gcc-10) — PASS, 0 errors, 0 warnings, 0 section mismatches -------------------------------------------------------------------------------- lpc18xx_defconfig (arm, gcc-10) — PASS, 0 errors, 0 warnings, 0 section mismatches -------------------------------------------------------------------------------- lpc32xx_defconfig (arm, gcc-10) — PASS, 0 errors, 0 warnings, 0 section mismatches -------------------------------------------------------------------------------- lpd270_defconfig (arm, gcc-10) — PASS, 0 errors, 0 warnings, 0 section mismatches -------------------------------------------------------------------------------- lubbock_defconfig (arm, gcc-10) — PASS, 0 errors, 0 warnings, 0 section mismatches -------------------------------------------------------------------------------- magician_defconfig (arm, gcc-10) — PASS, 0 errors, 0 warnings, 0 section mismatches -------------------------------------------------------------------------------- mainstone_defconfig (arm, gcc-10) — PASS, 0 errors, 0 warnings, 0 section mismatches -------------------------------------------------------------------------------- malta_defconfig (mips, gcc-10) — PASS, 0 errors, 0 warnings, 0 section mismatches -------------------------------------------------------------------------------- malta_kvm_defconfig (mips, gcc-10) — PASS, 0 errors, 0 warnings, 0 section mismatches -------------------------------------------------------------------------------- malta_qemu_32r6_defconfig (mips, gcc-10) — PASS, 0 errors, 0 warnings, 0 section mismatches -------------------------------------------------------------------------------- maltaaprp_defconfig (mips, gcc-10) — PASS, 0 errors, 0 warnings, 0 section mismatches -------------------------------------------------------------------------------- maltasmvp_defconfig (mips, gcc-10) — PASS, 0 errors, 0 warnings, 0 section mismatches -------------------------------------------------------------------------------- maltasmvp_eva_defconfig (mips, gcc-10) — PASS, 0 errors, 0 warnings, 0 section mismatches -------------------------------------------------------------------------------- maltaup_defconfig (mips, gcc-10) — PASS, 0 errors, 0 warnings, 0 section mismatches -------------------------------------------------------------------------------- maltaup_xpa_defconfig (mips, gcc-10) — PASS, 0 errors, 0 warnings, 0 section mismatches -------------------------------------------------------------------------------- milbeaut_m10v_defconfig (arm, gcc-10) — PASS, 0 errors, 0 warnings, 0 section mismatches -------------------------------------------------------------------------------- mini2440_defconfig (arm, gcc-10) — PASS, 0 errors, 0 warnings, 0 section mismatches -------------------------------------------------------------------------------- mmp2_defconfig (arm, gcc-10) — PASS, 0 errors, 0 warnings, 0 section mismatches -------------------------------------------------------------------------------- moxart_defconfig (arm, gcc-10) — PASS, 0 errors, 0 warnings, 0 section mismatches -------------------------------------------------------------------------------- mpc30x_defconfig (mips, gcc-10) — PASS, 0 errors, 0 warnings, 0 section mismatches -------------------------------------------------------------------------------- mps2_defconfig (arm, gcc-10) — PASS, 0 errors, 0 warnings, 0 section mismatches -------------------------------------------------------------------------------- mtx1_defconfig (mips, gcc-10) — PASS, 0 errors, 0 warnings, 0 section mismatches -------------------------------------------------------------------------------- multi_v4t_defconfig (arm, gcc-10) — PASS, 0 errors, 0 warnings, 0 section mismatches -------------------------------------------------------------------------------- multi_v5_defconfig (arm, gcc-10) — PASS, 0 errors, 0 warnings, 0 section mismatches -------------------------------------------------------------------------------- multi_v5_defconfig (arm, clang-10) — PASS, 0 errors, 0 warnings, 0 section mismatches -------------------------------------------------------------------------------- multi_v7_defconfig (arm, clang-10) — FAIL, 2 errors, 0 warnings, 0 section mismatches Errors: arch/arm/kernel/entry-armv.S:500:4: error: invalid instruction, any one of the following would fix this: arch/arm/kernel/entry-armv.S:504:4: error: invalid instruction, any one of the following would fix this: -------------------------------------------------------------------------------- multi_v7_defconfig (arm, gcc-10) — PASS, 0 errors, 0 warnings, 0 section mismatches -------------------------------------------------------------------------------- multi_v7_defconfig+CONFIG_CPU_BIG_ENDIAN=y (arm, gcc-10) — PASS, 0 errors, 0 warnings, 0 section mismatches -------------------------------------------------------------------------------- multi_v7_defconfig+CONFIG_EFI=y+CONFIG_ARM_LPAE=y (arm, gcc-10) — PASS, 0 errors, 0 warnings, 0 section mismatches -------------------------------------------------------------------------------- multi_v7_defconfig+CONFIG_SMP=n (arm, gcc-10) — PASS, 0 errors, 0 warnings, 0 section mismatches -------------------------------------------------------------------------------- multi_v7_defconfig+CONFIG_THUMB2_KERNEL=y (arm, gcc-10) — PASS, 0 errors, 0 warnings, 0 section mismatches -------------------------------------------------------------------------------- multi_v7_defconfig+crypto (arm, gcc-10) — PASS, 0 errors, 0 warnings, 0 section mismatches -------------------------------------------------------------------------------- multi_v7_defconfig+ima (arm, gcc-10) — PASS, 0 errors, 0 warnings, 0 section mismatches -------------------------------------------------------------------------------- multi_v7_defconfig+kselftest (arm, gcc-10) — PASS, 0 errors, 0 warnings, 0 section mismatches -------------------------------------------------------------------------------- mvebu_v5_defconfig (arm, gcc-10) — PASS, 0 errors, 0 warnings, 0 section mismatches -------------------------------------------------------------------------------- mvebu_v7_defconfig (arm, gcc-10) — PASS, 0 errors, 0 warnings, 0 section mismatches -------------------------------------------------------------------------------- mxs_defconfig (arm, gcc-10) — PASS, 0 errors, 0 warnings, 0 section mismatches -------------------------------------------------------------------------------- neponset_defconfig (arm, gcc-10) — PASS, 0 errors, 0 warnings, 0 section mismatches -------------------------------------------------------------------------------- netwinder_defconfig (arm, gcc-10) — PASS, 0 errors, 0 warnings, 0 section mismatches -------------------------------------------------------------------------------- nhk8815_defconfig (arm, gcc-10) — PASS, 0 errors, 0 warnings, 0 section mismatches -------------------------------------------------------------------------------- nlm_xlp_defconfig (mips, gcc-10) — PASS, 0 errors, 0 warnings, 0 section mismatches -------------------------------------------------------------------------------- nlm_xlr_defconfig (mips, gcc-10) — PASS, 0 errors, 0 warnings, 0 section mismatches -------------------------------------------------------------------------------- nommu_k210_defconfig (riscv, gcc-10) — PASS, 0 errors, 0 warnings, 0 section mismatches -------------------------------------------------------------------------------- nommu_k210_sdcard_defconfig (riscv, gcc-10) — PASS, 0 errors, 0 warnings, 0 section mismatches -------------------------------------------------------------------------------- nsimosci_hs_defconfig (arc, gcc-10) — PASS, 0 errors, 0 warnings, 0 section mismatches -------------------------------------------------------------------------------- nsimosci_hs_smp_defconfig (arc, gcc-10) — PASS, 0 errors, 0 warnings, 0 section mismatches -------------------------------------------------------------------------------- omap1_defconfig (arm, gcc-10) — PASS, 0 errors, 0 warnings, 0 section mismatches -------------------------------------------------------------------------------- omega2p_defconfig (mips, gcc-10) — PASS, 0 errors, 0 warnings, 0 section mismatches -------------------------------------------------------------------------------- orion5x_defconfig (arm, gcc-10) — PASS, 0 errors, 0 warnings, 0 section mismatches -------------------------------------------------------------------------------- oxnas_v6_defconfig (arm, gcc-10) — PASS, 0 errors, 0 warnings, 0 section mismatches -------------------------------------------------------------------------------- palmz72_defconfig (arm, gcc-10) — PASS, 0 errors, 0 warnings, 0 section mismatches -------------------------------------------------------------------------------- pcm027_defconfig (arm, gcc-10) — PASS, 0 errors, 0 warnings, 0 section mismatches -------------------------------------------------------------------------------- pic32mzda_defconfig (mips, gcc-10) — PASS, 0 errors, 0 warnings, 0 section mismatches -------------------------------------------------------------------------------- pleb_defconfig (arm, gcc-10) — PASS, 0 errors, 0 warnings, 0 section mismatches -------------------------------------------------------------------------------- pxa168_defconfig (arm, gcc-10) — PASS, 0 errors, 0 warnings, 0 section mismatches -------------------------------------------------------------------------------- pxa255-idp_defconfig (arm, gcc-10) — PASS, 0 errors, 0 warnings, 0 section mismatches -------------------------------------------------------------------------------- pxa3xx_defconfig (arm, gcc-10) — PASS, 0 errors, 0 warnings, 0 section mismatches -------------------------------------------------------------------------------- pxa910_defconfig (arm, gcc-10) — PASS, 0 errors, 0 warnings, 0 section mismatches -------------------------------------------------------------------------------- pxa_defconfig (arm, gcc-10) — PASS, 0 errors, 0 warnings, 0 section mismatches -------------------------------------------------------------------------------- qcom_defconfig (arm, gcc-10) — PASS, 0 errors, 0 warnings, 0 section mismatches -------------------------------------------------------------------------------- qi_lb60_defconfig (mips, gcc-10) — PASS, 0 errors, 0 warnings, 0 section mismatches -------------------------------------------------------------------------------- rb532_defconfig (mips, gcc-10) — PASS, 0 errors, 0 warnings, 0 section mismatches -------------------------------------------------------------------------------- rbtx49xx_defconfig (mips, gcc-10) — PASS, 0 errors, 0 warnings, 0 section mismatches -------------------------------------------------------------------------------- realview_defconfig (arm, gcc-10) — PASS, 0 errors, 0 warnings, 0 section mismatches -------------------------------------------------------------------------------- rm200_defconfig (mips, gcc-10) — PASS, 0 errors, 1 warning, 0 section mismatches Warnings: drivers/block/paride/bpck.c:32: warning: "PC" redefined -------------------------------------------------------------------------------- rpc_defconfig (arm, gcc-10) — FAIL, 4 errors, 0 warnings, 0 section mismatches Errors: arm-linux-gnueabihf-gcc: error: unrecognized -march target: armv3m arm-linux-gnueabihf-gcc: error: missing argument to ‘-march=’ arm-linux-gnueabihf-gcc: error: unrecognized -march target: armv3m arm-linux-gnueabihf-gcc: error: missing argument to ‘-march=’ -------------------------------------------------------------------------------- rs90_defconfig (mips, gcc-10) — PASS, 0 errors, 0 warnings, 0 section mismatches -------------------------------------------------------------------------------- rv32_defconfig (riscv, gcc-10) — PASS, 0 errors, 0 warnings, 0 section mismatches -------------------------------------------------------------------------------- s3c2410_defconfig (arm, gcc-10) — PASS, 0 errors, 0 warnings, 0 section mismatches -------------------------------------------------------------------------------- s3c6400_defconfig (arm, gcc-10) — PASS, 0 errors, 0 warnings, 0 section mismatches -------------------------------------------------------------------------------- s5pv210_defconfig (arm, gcc-10) — PASS, 0 errors, 0 warnings, 0 section mismatches -------------------------------------------------------------------------------- sama5_defconfig (arm, gcc-10) — PASS, 0 errors, 0 warnings, 0 section mismatches -------------------------------------------------------------------------------- sama7_defconfig (arm, gcc-10) — PASS, 0 errors, 0 warnings, 0 section mismatches -------------------------------------------------------------------------------- sb1250_swarm_defconfig (mips, gcc-10) — PASS, 0 errors, 0 warnings, 0 section mismatches -------------------------------------------------------------------------------- shannon_defconfig (arm, gcc-10) — PASS, 0 errors, 0 warnings, 0 section mismatches -------------------------------------------------------------------------------- shmobile_defconfig (arm, gcc-10) — PASS, 0 errors, 0 warnings, 0 section mismatches -------------------------------------------------------------------------------- simpad_defconfig (arm, gcc-10) — PASS, 0 errors, 0 warnings, 0 section mismatches -------------------------------------------------------------------------------- socfpga_defconfig (arm, gcc-10) — PASS, 0 errors, 0 warnings, 0 section mismatches -------------------------------------------------------------------------------- spear13xx_defconfig (arm, gcc-10) — PASS, 0 errors, 0 warnings, 0 section mismatches -------------------------------------------------------------------------------- spear3xx_defconfig (arm, gcc-10) — PASS, 0 errors, 0 warnings, 0 section mismatches -------------------------------------------------------------------------------- spear6xx_defconfig (arm, gcc-10) — PASS, 0 errors, 0 warnings, 0 section mismatches -------------------------------------------------------------------------------- spitz_defconfig (arm, gcc-10) — PASS, 0 errors, 0 warnings, 0 section mismatches -------------------------------------------------------------------------------- stm32_defconfig (arm, gcc-10) — PASS, 0 errors, 0 warnings, 0 section mismatches -------------------------------------------------------------------------------- sunxi_defconfig (arm, gcc-10) — PASS, 0 errors, 0 warnings, 0 section mismatches -------------------------------------------------------------------------------- tb0219_defconfig (mips, gcc-10) — PASS, 0 errors, 0 warnings, 0 section mismatches -------------------------------------------------------------------------------- tb0226_defconfig (mips, gcc-10) — PASS, 0 errors, 0 warnings, 0 section mismatches -------------------------------------------------------------------------------- tb0287_defconfig (mips, gcc-10) — PASS, 0 errors, 0 warnings, 0 section mismatches -------------------------------------------------------------------------------- tct_hammer_defconfig (arm, gcc-10) — PASS, 0 errors, 0 warnings, 0 section mismatches -------------------------------------------------------------------------------- tegra_defconfig (arm, gcc-10) — PASS, 0 errors, 0 warnings, 0 section mismatches -------------------------------------------------------------------------------- tinyconfig (arc, gcc-10) — PASS, 0 errors, 1 warning, 0 section mismatches Warnings: arch/arc/Makefile:26: ** WARNING ** CONFIG_ARC_TUNE_MCPU flag '' is unknown, fallback to '' -------------------------------------------------------------------------------- tinyconfig (i386, gcc-10) — PASS, 0 errors, 0 warnings, 0 section mismatches -------------------------------------------------------------------------------- tinyconfig (x86_64, gcc-10) — PASS, 0 errors, 0 warnings, 0 section mismatches -------------------------------------------------------------------------------- trizeps4_defconfig (arm, gcc-10) — PASS, 0 errors, 0 warnings, 0 section mismatches -------------------------------------------------------------------------------- u8500_defconfig (arm, gcc-10) — PASS, 0 errors, 0 warnings, 0 section mismatches -------------------------------------------------------------------------------- vdk_hs38_defconfig (arc, gcc-10) — PASS, 0 errors, 0 warnings, 0 section mismatches -------------------------------------------------------------------------------- versatile_defconfig (arm, gcc-10) — PASS, 0 errors, 0 warnings, 0 section mismatches -------------------------------------------------------------------------------- vexpress_defconfig (arm, gcc-10) — PASS, 0 errors, 0 warnings, 0 section mismatches -------------------------------------------------------------------------------- vf610m4_defconfig (arm, gcc-10) — PASS, 0 errors, 0 warnings, 0 section mismatches -------------------------------------------------------------------------------- viper_defconfig (arm, gcc-10) — PASS, 0 errors, 0 warnings, 0 section mismatches -------------------------------------------------------------------------------- vocore2_defconfig (mips, gcc-10) — PASS, 0 errors, 0 warnings, 0 section mismatches -------------------------------------------------------------------------------- vt8500_v6_v7_defconfig (arm, gcc-10) — PASS, 0 errors, 0 warnings, 0 section mismatches -------------------------------------------------------------------------------- workpad_defconfig (mips, gcc-10) — PASS, 0 errors, 0 warnings, 0 section mismatches -------------------------------------------------------------------------------- x86_64_defconfig (x86_64, clang-10) — FAIL, 1 error, 0 warnings, 0 section mismatches Errors: <instantiation>:2:2: error: unknown use of instruction mnemonic without a size suffix -------------------------------------------------------------------------------- x86_64_defconfig (x86_64, gcc-10) — PASS, 0 errors, 0 warnings, 0 section mismatches -------------------------------------------------------------------------------- x86_64_defconfig+crypto (x86_64, gcc-10) — PASS, 0 errors, 0 warnings, 0 section mismatches -------------------------------------------------------------------------------- x86_64_defconfig+ima (x86_64, gcc-10) — PASS, 0 errors, 0 warnings, 0 section mismatches -------------------------------------------------------------------------------- x86_64_defconfig+kselftest (x86_64, gcc-10) — PASS, 0 errors, 0 warnings, 0 section mismatches -------------------------------------------------------------------------------- x86_64_defconfig+x86-chromebook (x86_64, gcc-10) — PASS, 0 errors, 0 warnings, 0 section mismatches -------------------------------------------------------------------------------- x86_64_defconfig+x86-chromebook+kselftest (x86_64, gcc-10) — PASS, 0 errors, 0 warnings, 0 section mismatches -------------------------------------------------------------------------------- x86_64_defconfig+x86_kvm_guest (x86_64, gcc-10) — PASS, 0 errors, 0 warnings, 0 section mismatches -------------------------------------------------------------------------------- xcep_defconfig (arm, gcc-10) — PASS, 0 errors, 0 warnings, 0 section mismatches -------------------------------------------------------------------------------- zeus_defconfig (arm, gcc-10) — PASS, 0 errors, 0 warnings, 0 section mismatches --- For more info write to <info(a)kernelci.org>
3 years, 4 months
1
0
0
0
next/pending-fixes build: 202 builds: 6 failed, 196 passed, 6 errors, 9 warnings (v5.15-rc7-176-gbfbd58926fc5)
by kernelci.org bot
next/pending-fixes build: 202 builds: 6 failed, 196 passed, 6 errors, 9 warnings (v5.15-rc7-176-gbfbd58926fc5) Full Build Summary:
https://kernelci.org/build/next/branch/pending-fixes/kernel/v5.15-rc7-176-g…
Tree: next Branch: pending-fixes Git Describe: v5.15-rc7-176-gbfbd58926fc5 Git Commit: bfbd58926fc51b1cc34e4ec9b9113d8324267c36 Git URL:
https://git.kernel.org/pub/scm/linux/kernel/git/next/linux-next.git
Built: 7 unique architectures Build Failures Detected: arm: rpc_defconfig: (gcc-10) FAIL mips: decstation_64_defconfig: (gcc-10) FAIL ip27_defconfig: (gcc-10) FAIL ip28_defconfig: (gcc-10) FAIL lemote2f_defconfig: (gcc-10) FAIL x86_64: allmodconfig: (gcc-10) FAIL Errors and Warnings Detected: arc: haps_hs_smp_defconfig+kselftest (gcc-10): 3 warnings tinyconfig (gcc-10): 1 warning arm64: arm: rpc_defconfig (gcc-10): 4 errors i386: mips: 32r2el_defconfig (gcc-10): 1 warning 32r2el_defconfig+kselftest (gcc-10): 1 warning lemote2f_defconfig (gcc-10): 1 warning loongson2k_defconfig (gcc-10): 1 warning rm200_defconfig (gcc-10): 1 warning riscv: x86_64: allmodconfig (gcc-10): 2 errors Errors summary: 2 arm-linux-gnueabihf-gcc: error: unrecognized -march target: armv3m 2 arm-linux-gnueabihf-gcc: error: missing argument to ‘-march=’ 2 /usr/lib/gcc/x86_64-linux-gnu/10/plugin/include/config/i386/i386.h:2500:10: fatal error: common/config/i386/i386-cpuinfo.h: No such file or directory Warnings summary: 2 net/mac80211/mlme.c:4345:1: warning: the frame size of 1200 bytes is larger than 1024 bytes [-Wframe-larger-than=] 2 arch/mips/boot/dts/img/boston.dts:128.19-178.5: Warning (pci_device_reg): /pci@14000000/pci2_root@0,0,0: PCI unit address format error, expected "0,0" 2 arch/arc/Makefile:26: ** WARNING ** CONFIG_ARC_TUNE_MCPU flag '' is unknown, fallback to '' 1 drivers/block/paride/bpck.c:32: warning: "PC" redefined 1 arch/arc/include/asm/perf_event.h:91:27: warning: 'arc_pmu_ev_hw_map' defined but not used [-Wunused-const-variable=] 1 arch/arc/include/asm/perf_event.h:126:27: warning: 'arc_pmu_cache_map' defined but not used [-Wunused-const-variable=] ================================================================================ Detailed per-defconfig build reports: -------------------------------------------------------------------------------- 32r2el_defconfig (mips, gcc-10) — PASS, 0 errors, 1 warning, 0 section mismatches Warnings: arch/mips/boot/dts/img/boston.dts:128.19-178.5: Warning (pci_device_reg): /pci@14000000/pci2_root@0,0,0: PCI unit address format error, expected "0,0" -------------------------------------------------------------------------------- 32r2el_defconfig+kselftest (mips, gcc-10) — PASS, 0 errors, 1 warning, 0 section mismatches Warnings: arch/mips/boot/dts/img/boston.dts:128.19-178.5: Warning (pci_device_reg): /pci@14000000/pci2_root@0,0,0: PCI unit address format error, expected "0,0" -------------------------------------------------------------------------------- allmodconfig (x86_64, gcc-10) — FAIL, 2 errors, 0 warnings, 0 section mismatches Errors: /usr/lib/gcc/x86_64-linux-gnu/10/plugin/include/config/i386/i386.h:2500:10: fatal error: common/config/i386/i386-cpuinfo.h: No such file or directory /usr/lib/gcc/x86_64-linux-gnu/10/plugin/include/config/i386/i386.h:2500:10: fatal error: common/config/i386/i386-cpuinfo.h: No such file or directory -------------------------------------------------------------------------------- allmodconfig (arm, gcc-10) — PASS, 0 errors, 0 warnings, 0 section mismatches -------------------------------------------------------------------------------- allnoconfig (i386, gcc-10) — PASS, 0 errors, 0 warnings, 0 section mismatches -------------------------------------------------------------------------------- allnoconfig (arc, gcc-10) — PASS, 0 errors, 0 warnings, 0 section mismatches -------------------------------------------------------------------------------- allnoconfig (x86_64, gcc-10) — PASS, 0 errors, 0 warnings, 0 section mismatches -------------------------------------------------------------------------------- am200epdkit_defconfig (arm, gcc-10) — PASS, 0 errors, 0 warnings, 0 section mismatches -------------------------------------------------------------------------------- ar7_defconfig (mips, gcc-10) — PASS, 0 errors, 0 warnings, 0 section mismatches -------------------------------------------------------------------------------- aspeed_g4_defconfig (arm, gcc-10) — PASS, 0 errors, 0 warnings, 0 section mismatches -------------------------------------------------------------------------------- aspeed_g5_defconfig (arm, gcc-10) — PASS, 0 errors, 0 warnings, 0 section mismatches -------------------------------------------------------------------------------- assabet_defconfig (arm, gcc-10) — PASS, 0 errors, 0 warnings, 0 section mismatches -------------------------------------------------------------------------------- at91_dt_defconfig (arm, gcc-10) — PASS, 0 errors, 0 warnings, 0 section mismatches -------------------------------------------------------------------------------- ath25_defconfig (mips, gcc-10) — PASS, 0 errors, 0 warnings, 0 section mismatches -------------------------------------------------------------------------------- ath79_defconfig (mips, gcc-10) — PASS, 0 errors, 0 warnings, 0 section mismatches -------------------------------------------------------------------------------- axm55xx_defconfig (arm, gcc-10) — PASS, 0 errors, 0 warnings, 0 section mismatches -------------------------------------------------------------------------------- axs103_defconfig (arc, gcc-10) — PASS, 0 errors, 0 warnings, 0 section mismatches -------------------------------------------------------------------------------- axs103_smp_defconfig (arc, gcc-10) — PASS, 0 errors, 0 warnings, 0 section mismatches -------------------------------------------------------------------------------- badge4_defconfig (arm, gcc-10) — PASS, 0 errors, 0 warnings, 0 section mismatches -------------------------------------------------------------------------------- bcm2835_defconfig (arm, gcc-10) — PASS, 0 errors, 0 warnings, 0 section mismatches -------------------------------------------------------------------------------- bcm47xx_defconfig (mips, gcc-10) — PASS, 0 errors, 0 warnings, 0 section mismatches -------------------------------------------------------------------------------- bcm63xx_defconfig (mips, gcc-10) — PASS, 0 errors, 0 warnings, 0 section mismatches -------------------------------------------------------------------------------- bigsur_defconfig (mips, gcc-10) — PASS, 0 errors, 0 warnings, 0 section mismatches -------------------------------------------------------------------------------- bmips_be_defconfig (mips, gcc-10) — PASS, 0 errors, 0 warnings, 0 section mismatches -------------------------------------------------------------------------------- bmips_stb_defconfig (mips, gcc-10) — PASS, 0 errors, 0 warnings, 0 section mismatches -------------------------------------------------------------------------------- capcella_defconfig (mips, gcc-10) — PASS, 0 errors, 0 warnings, 0 section mismatches -------------------------------------------------------------------------------- cavium_octeon_defconfig (mips, gcc-10) — PASS, 0 errors, 0 warnings, 0 section mismatches -------------------------------------------------------------------------------- cerfcube_defconfig (arm, gcc-10) — PASS, 0 errors, 0 warnings, 0 section mismatches -------------------------------------------------------------------------------- ci20_defconfig (mips, gcc-10) — PASS, 0 errors, 0 warnings, 0 section mismatches -------------------------------------------------------------------------------- cm_x300_defconfig (arm, gcc-10) — PASS, 0 errors, 0 warnings, 0 section mismatches -------------------------------------------------------------------------------- cobalt_defconfig (mips, gcc-10) — PASS, 0 errors, 0 warnings, 0 section mismatches -------------------------------------------------------------------------------- colibri_pxa270_defconfig (arm, gcc-10) — PASS, 0 errors, 0 warnings, 0 section mismatches -------------------------------------------------------------------------------- colibri_pxa300_defconfig (arm, gcc-10) — PASS, 0 errors, 0 warnings, 0 section mismatches -------------------------------------------------------------------------------- collie_defconfig (arm, gcc-10) — PASS, 0 errors, 0 warnings, 0 section mismatches -------------------------------------------------------------------------------- corgi_defconfig (arm, gcc-10) — PASS, 0 errors, 0 warnings, 0 section mismatches -------------------------------------------------------------------------------- cu1000-neo_defconfig (mips, gcc-10) — PASS, 0 errors, 0 warnings, 0 section mismatches -------------------------------------------------------------------------------- cu1830-neo_defconfig (mips, gcc-10) — PASS, 0 errors, 0 warnings, 0 section mismatches -------------------------------------------------------------------------------- davinci_all_defconfig (arm, gcc-10) — PASS, 0 errors, 0 warnings, 0 section mismatches -------------------------------------------------------------------------------- db1xxx_defconfig (mips, gcc-10) — PASS, 0 errors, 0 warnings, 0 section mismatches -------------------------------------------------------------------------------- decstation_64_defconfig (mips, gcc-10) — FAIL, 0 errors, 0 warnings, 0 section mismatches -------------------------------------------------------------------------------- decstation_defconfig (mips, gcc-10) — PASS, 0 errors, 0 warnings, 0 section mismatches -------------------------------------------------------------------------------- decstation_r4k_defconfig (mips, gcc-10) — PASS, 0 errors, 0 warnings, 0 section mismatches -------------------------------------------------------------------------------- defconfig (riscv, gcc-10) — PASS, 0 errors, 0 warnings, 0 section mismatches -------------------------------------------------------------------------------- defconfig (arm64, gcc-10) — PASS, 0 errors, 0 warnings, 0 section mismatches -------------------------------------------------------------------------------- defconfig+CONFIG_CPU_BIG_ENDIAN=y (arm64, gcc-10) — PASS, 0 errors, 0 warnings, 0 section mismatches -------------------------------------------------------------------------------- defconfig+CONFIG_RANDOMIZE_BASE=y (arm64, gcc-10) — PASS, 0 errors, 0 warnings, 0 section mismatches -------------------------------------------------------------------------------- defconfig+crypto (arm64, gcc-10) — PASS, 0 errors, 0 warnings, 0 section mismatches -------------------------------------------------------------------------------- defconfig+ima (arm64, gcc-10) — PASS, 0 errors, 0 warnings, 0 section mismatches -------------------------------------------------------------------------------- defconfig+kselftest (riscv, gcc-10) — PASS, 0 errors, 0 warnings, 0 section mismatches -------------------------------------------------------------------------------- defconfig+kselftest (arm64, gcc-10) — PASS, 0 errors, 0 warnings, 0 section mismatches -------------------------------------------------------------------------------- dove_defconfig (arm, gcc-10) — PASS, 0 errors, 0 warnings, 0 section mismatches -------------------------------------------------------------------------------- e55_defconfig (mips, gcc-10) — PASS, 0 errors, 0 warnings, 0 section mismatches -------------------------------------------------------------------------------- ep93xx_defconfig (arm, gcc-10) — PASS, 0 errors, 0 warnings, 0 section mismatches -------------------------------------------------------------------------------- eseries_pxa_defconfig (arm, gcc-10) — PASS, 0 errors, 0 warnings, 0 section mismatches -------------------------------------------------------------------------------- exynos_defconfig (arm, gcc-10) — PASS, 0 errors, 0 warnings, 0 section mismatches -------------------------------------------------------------------------------- ezx_defconfig (arm, gcc-10) — PASS, 0 errors, 0 warnings, 0 section mismatches -------------------------------------------------------------------------------- footbridge_defconfig (arm, gcc-10) — PASS, 0 errors, 0 warnings, 0 section mismatches -------------------------------------------------------------------------------- fuloong2e_defconfig (mips, gcc-10) — PASS, 0 errors, 0 warnings, 0 section mismatches -------------------------------------------------------------------------------- gcw0_defconfig (mips, gcc-10) — PASS, 0 errors, 0 warnings, 0 section mismatches -------------------------------------------------------------------------------- gemini_defconfig (arm, gcc-10) — PASS, 0 errors, 0 warnings, 0 section mismatches -------------------------------------------------------------------------------- gpr_defconfig (mips, gcc-10) — PASS, 0 errors, 0 warnings, 0 section mismatches -------------------------------------------------------------------------------- h3600_defconfig (arm, gcc-10) — PASS, 0 errors, 0 warnings, 0 section mismatches -------------------------------------------------------------------------------- h5000_defconfig (arm, gcc-10) — PASS, 0 errors, 0 warnings, 0 section mismatches -------------------------------------------------------------------------------- hackkit_defconfig (arm, gcc-10) — PASS, 0 errors, 0 warnings, 0 section mismatches -------------------------------------------------------------------------------- haps_hs_defconfig (arc, gcc-10) — PASS, 0 errors, 0 warnings, 0 section mismatches -------------------------------------------------------------------------------- haps_hs_smp_defconfig (arc, gcc-10) — PASS, 0 errors, 0 warnings, 0 section mismatches -------------------------------------------------------------------------------- haps_hs_smp_defconfig+kselftest (arc, gcc-10) — PASS, 0 errors, 3 warnings, 0 section mismatches Warnings: arch/arc/Makefile:26: ** WARNING ** CONFIG_ARC_TUNE_MCPU flag '' is unknown, fallback to '' arch/arc/include/asm/perf_event.h:126:27: warning: 'arc_pmu_cache_map' defined but not used [-Wunused-const-variable=] arch/arc/include/asm/perf_event.h:91:27: warning: 'arc_pmu_ev_hw_map' defined but not used [-Wunused-const-variable=] -------------------------------------------------------------------------------- hisi_defconfig (arm, gcc-10) — PASS, 0 errors, 0 warnings, 0 section mismatches -------------------------------------------------------------------------------- hsdk_defconfig (arc, gcc-10) — PASS, 0 errors, 0 warnings, 0 section mismatches -------------------------------------------------------------------------------- i386_defconfig (i386, gcc-10) — PASS, 0 errors, 0 warnings, 0 section mismatches -------------------------------------------------------------------------------- i386_defconfig+kselftest (i386, gcc-10) — PASS, 0 errors, 0 warnings, 0 section mismatches -------------------------------------------------------------------------------- imote2_defconfig (arm, gcc-10) — PASS, 0 errors, 0 warnings, 0 section mismatches -------------------------------------------------------------------------------- imx_v4_v5_defconfig (arm, gcc-10) — PASS, 0 errors, 0 warnings, 0 section mismatches -------------------------------------------------------------------------------- imx_v6_v7_defconfig (arm, gcc-10) — PASS, 0 errors, 0 warnings, 0 section mismatches -------------------------------------------------------------------------------- integrator_defconfig (arm, gcc-10) — PASS, 0 errors, 0 warnings, 0 section mismatches -------------------------------------------------------------------------------- iop32x_defconfig (arm, gcc-10) — PASS, 0 errors, 0 warnings, 0 section mismatches -------------------------------------------------------------------------------- ip22_defconfig (mips, gcc-10) — PASS, 0 errors, 0 warnings, 0 section mismatches -------------------------------------------------------------------------------- ip27_defconfig (mips, gcc-10) — FAIL, 0 errors, 0 warnings, 0 section mismatches -------------------------------------------------------------------------------- ip28_defconfig (mips, gcc-10) — FAIL, 0 errors, 0 warnings, 0 section mismatches -------------------------------------------------------------------------------- ip32_defconfig (mips, gcc-10) — PASS, 0 errors, 0 warnings, 0 section mismatches -------------------------------------------------------------------------------- ixp4xx_defconfig (arm, gcc-10) — PASS, 0 errors, 0 warnings, 0 section mismatches -------------------------------------------------------------------------------- jazz_defconfig (mips, gcc-10) — PASS, 0 errors, 0 warnings, 0 section mismatches -------------------------------------------------------------------------------- jmr3927_defconfig (mips, gcc-10) — PASS, 0 errors, 0 warnings, 0 section mismatches -------------------------------------------------------------------------------- jornada720_defconfig (arm, gcc-10) — PASS, 0 errors, 0 warnings, 0 section mismatches -------------------------------------------------------------------------------- keystone_defconfig (arm, gcc-10) — PASS, 0 errors, 0 warnings, 0 section mismatches -------------------------------------------------------------------------------- lart_defconfig (arm, gcc-10) — PASS, 0 errors, 0 warnings, 0 section mismatches -------------------------------------------------------------------------------- lemote2f_defconfig (mips, gcc-10) — FAIL, 0 errors, 1 warning, 0 section mismatches Warnings: net/mac80211/mlme.c:4345:1: warning: the frame size of 1200 bytes is larger than 1024 bytes [-Wframe-larger-than=] -------------------------------------------------------------------------------- loongson1b_defconfig (mips, gcc-10) — PASS, 0 errors, 0 warnings, 0 section mismatches -------------------------------------------------------------------------------- loongson1c_defconfig (mips, gcc-10) — PASS, 0 errors, 0 warnings, 0 section mismatches -------------------------------------------------------------------------------- loongson2k_defconfig (mips, gcc-10) — PASS, 0 errors, 1 warning, 0 section mismatches Warnings: net/mac80211/mlme.c:4345:1: warning: the frame size of 1200 bytes is larger than 1024 bytes [-Wframe-larger-than=] -------------------------------------------------------------------------------- loongson3_defconfig (mips, gcc-10) — PASS, 0 errors, 0 warnings, 0 section mismatches -------------------------------------------------------------------------------- lpc18xx_defconfig (arm, gcc-10) — PASS, 0 errors, 0 warnings, 0 section mismatches -------------------------------------------------------------------------------- lpc32xx_defconfig (arm, gcc-10) — PASS, 0 errors, 0 warnings, 0 section mismatches -------------------------------------------------------------------------------- lpd270_defconfig (arm, gcc-10) — PASS, 0 errors, 0 warnings, 0 section mismatches -------------------------------------------------------------------------------- lubbock_defconfig (arm, gcc-10) — PASS, 0 errors, 0 warnings, 0 section mismatches -------------------------------------------------------------------------------- magician_defconfig (arm, gcc-10) — PASS, 0 errors, 0 warnings, 0 section mismatches -------------------------------------------------------------------------------- mainstone_defconfig (arm, gcc-10) — PASS, 0 errors, 0 warnings, 0 section mismatches -------------------------------------------------------------------------------- malta_defconfig (mips, gcc-10) — PASS, 0 errors, 0 warnings, 0 section mismatches -------------------------------------------------------------------------------- malta_kvm_defconfig (mips, gcc-10) — PASS, 0 errors, 0 warnings, 0 section mismatches -------------------------------------------------------------------------------- malta_qemu_32r6_defconfig (mips, gcc-10) — PASS, 0 errors, 0 warnings, 0 section mismatches -------------------------------------------------------------------------------- maltaaprp_defconfig (mips, gcc-10) — PASS, 0 errors, 0 warnings, 0 section mismatches -------------------------------------------------------------------------------- maltasmvp_defconfig (mips, gcc-10) — PASS, 0 errors, 0 warnings, 0 section mismatches -------------------------------------------------------------------------------- maltasmvp_eva_defconfig (mips, gcc-10) — PASS, 0 errors, 0 warnings, 0 section mismatches -------------------------------------------------------------------------------- maltaup_defconfig (mips, gcc-10) — PASS, 0 errors, 0 warnings, 0 section mismatches -------------------------------------------------------------------------------- maltaup_xpa_defconfig (mips, gcc-10) — PASS, 0 errors, 0 warnings, 0 section mismatches -------------------------------------------------------------------------------- milbeaut_m10v_defconfig (arm, gcc-10) — PASS, 0 errors, 0 warnings, 0 section mismatches -------------------------------------------------------------------------------- mini2440_defconfig (arm, gcc-10) — PASS, 0 errors, 0 warnings, 0 section mismatches -------------------------------------------------------------------------------- mmp2_defconfig (arm, gcc-10) — PASS, 0 errors, 0 warnings, 0 section mismatches -------------------------------------------------------------------------------- moxart_defconfig (arm, gcc-10) — PASS, 0 errors, 0 warnings, 0 section mismatches -------------------------------------------------------------------------------- mpc30x_defconfig (mips, gcc-10) — PASS, 0 errors, 0 warnings, 0 section mismatches -------------------------------------------------------------------------------- mps2_defconfig (arm, gcc-10) — PASS, 0 errors, 0 warnings, 0 section mismatches -------------------------------------------------------------------------------- mtx1_defconfig (mips, gcc-10) — PASS, 0 errors, 0 warnings, 0 section mismatches -------------------------------------------------------------------------------- multi_v4t_defconfig (arm, gcc-10) — PASS, 0 errors, 0 warnings, 0 section mismatches -------------------------------------------------------------------------------- multi_v5_defconfig (arm, gcc-10) — PASS, 0 errors, 0 warnings, 0 section mismatches -------------------------------------------------------------------------------- multi_v7_defconfig (arm, gcc-10) — PASS, 0 errors, 0 warnings, 0 section mismatches -------------------------------------------------------------------------------- multi_v7_defconfig+CONFIG_CPU_BIG_ENDIAN=y (arm, gcc-10) — PASS, 0 errors, 0 warnings, 0 section mismatches -------------------------------------------------------------------------------- multi_v7_defconfig+CONFIG_EFI=y+CONFIG_ARM_LPAE=y (arm, gcc-10) — PASS, 0 errors, 0 warnings, 0 section mismatches -------------------------------------------------------------------------------- multi_v7_defconfig+CONFIG_SMP=n (arm, gcc-10) — PASS, 0 errors, 0 warnings, 0 section mismatches -------------------------------------------------------------------------------- multi_v7_defconfig+CONFIG_THUMB2_KERNEL=y (arm, gcc-10) — PASS, 0 errors, 0 warnings, 0 section mismatches -------------------------------------------------------------------------------- multi_v7_defconfig+crypto (arm, gcc-10) — PASS, 0 errors, 0 warnings, 0 section mismatches -------------------------------------------------------------------------------- multi_v7_defconfig+ima (arm, gcc-10) — PASS, 0 errors, 0 warnings, 0 section mismatches -------------------------------------------------------------------------------- multi_v7_defconfig+kselftest (arm, gcc-10) — PASS, 0 errors, 0 warnings, 0 section mismatches -------------------------------------------------------------------------------- mvebu_v5_defconfig (arm, gcc-10) — PASS, 0 errors, 0 warnings, 0 section mismatches -------------------------------------------------------------------------------- mvebu_v7_defconfig (arm, gcc-10) — PASS, 0 errors, 0 warnings, 0 section mismatches -------------------------------------------------------------------------------- mxs_defconfig (arm, gcc-10) — PASS, 0 errors, 0 warnings, 0 section mismatches -------------------------------------------------------------------------------- neponset_defconfig (arm, gcc-10) — PASS, 0 errors, 0 warnings, 0 section mismatches -------------------------------------------------------------------------------- netwinder_defconfig (arm, gcc-10) — PASS, 0 errors, 0 warnings, 0 section mismatches -------------------------------------------------------------------------------- nhk8815_defconfig (arm, gcc-10) — PASS, 0 errors, 0 warnings, 0 section mismatches -------------------------------------------------------------------------------- nlm_xlp_defconfig (mips, gcc-10) — PASS, 0 errors, 0 warnings, 0 section mismatches -------------------------------------------------------------------------------- nlm_xlr_defconfig (mips, gcc-10) — PASS, 0 errors, 0 warnings, 0 section mismatches -------------------------------------------------------------------------------- nommu_k210_defconfig (riscv, gcc-10) — PASS, 0 errors, 0 warnings, 0 section mismatches -------------------------------------------------------------------------------- nommu_k210_sdcard_defconfig (riscv, gcc-10) — PASS, 0 errors, 0 warnings, 0 section mismatches -------------------------------------------------------------------------------- nsimosci_hs_defconfig (arc, gcc-10) — PASS, 0 errors, 0 warnings, 0 section mismatches -------------------------------------------------------------------------------- nsimosci_hs_smp_defconfig (arc, gcc-10) — PASS, 0 errors, 0 warnings, 0 section mismatches -------------------------------------------------------------------------------- omap1_defconfig (arm, gcc-10) — PASS, 0 errors, 0 warnings, 0 section mismatches -------------------------------------------------------------------------------- omap2plus_defconfig (arm, gcc-10) — PASS, 0 errors, 0 warnings, 0 section mismatches -------------------------------------------------------------------------------- omega2p_defconfig (mips, gcc-10) — PASS, 0 errors, 0 warnings, 0 section mismatches -------------------------------------------------------------------------------- orion5x_defconfig (arm, gcc-10) — PASS, 0 errors, 0 warnings, 0 section mismatches -------------------------------------------------------------------------------- oxnas_v6_defconfig (arm, gcc-10) — PASS, 0 errors, 0 warnings, 0 section mismatches -------------------------------------------------------------------------------- palmz72_defconfig (arm, gcc-10) — PASS, 0 errors, 0 warnings, 0 section mismatches -------------------------------------------------------------------------------- pcm027_defconfig (arm, gcc-10) — PASS, 0 errors, 0 warnings, 0 section mismatches -------------------------------------------------------------------------------- pic32mzda_defconfig (mips, gcc-10) — PASS, 0 errors, 0 warnings, 0 section mismatches -------------------------------------------------------------------------------- pleb_defconfig (arm, gcc-10) — PASS, 0 errors, 0 warnings, 0 section mismatches -------------------------------------------------------------------------------- pxa168_defconfig (arm, gcc-10) — PASS, 0 errors, 0 warnings, 0 section mismatches -------------------------------------------------------------------------------- pxa255-idp_defconfig (arm, gcc-10) — PASS, 0 errors, 0 warnings, 0 section mismatches -------------------------------------------------------------------------------- pxa3xx_defconfig (arm, gcc-10) — PASS, 0 errors, 0 warnings, 0 section mismatches -------------------------------------------------------------------------------- pxa910_defconfig (arm, gcc-10) — PASS, 0 errors, 0 warnings, 0 section mismatches -------------------------------------------------------------------------------- pxa_defconfig (arm, gcc-10) — PASS, 0 errors, 0 warnings, 0 section mismatches -------------------------------------------------------------------------------- qcom_defconfig (arm, gcc-10) — PASS, 0 errors, 0 warnings, 0 section mismatches -------------------------------------------------------------------------------- qi_lb60_defconfig (mips, gcc-10) — PASS, 0 errors, 0 warnings, 0 section mismatches -------------------------------------------------------------------------------- rb532_defconfig (mips, gcc-10) — PASS, 0 errors, 0 warnings, 0 section mismatches -------------------------------------------------------------------------------- rbtx49xx_defconfig (mips, gcc-10) — PASS, 0 errors, 0 warnings, 0 section mismatches -------------------------------------------------------------------------------- realview_defconfig (arm, gcc-10) — PASS, 0 errors, 0 warnings, 0 section mismatches -------------------------------------------------------------------------------- rm200_defconfig (mips, gcc-10) — PASS, 0 errors, 1 warning, 0 section mismatches Warnings: drivers/block/paride/bpck.c:32: warning: "PC" redefined -------------------------------------------------------------------------------- rpc_defconfig (arm, gcc-10) — FAIL, 4 errors, 0 warnings, 0 section mismatches Errors: arm-linux-gnueabihf-gcc: error: unrecognized -march target: armv3m arm-linux-gnueabihf-gcc: error: missing argument to ‘-march=’ arm-linux-gnueabihf-gcc: error: unrecognized -march target: armv3m arm-linux-gnueabihf-gcc: error: missing argument to ‘-march=’ -------------------------------------------------------------------------------- rs90_defconfig (mips, gcc-10) — PASS, 0 errors, 0 warnings, 0 section mismatches -------------------------------------------------------------------------------- rt305x_defconfig (mips, gcc-10) — PASS, 0 errors, 0 warnings, 0 section mismatches -------------------------------------------------------------------------------- rv32_defconfig (riscv, gcc-10) — PASS, 0 errors, 0 warnings, 0 section mismatches -------------------------------------------------------------------------------- s3c2410_defconfig (arm, gcc-10) — PASS, 0 errors, 0 warnings, 0 section mismatches -------------------------------------------------------------------------------- s3c6400_defconfig (arm, gcc-10) — PASS, 0 errors, 0 warnings, 0 section mismatches -------------------------------------------------------------------------------- s5pv210_defconfig (arm, gcc-10) — PASS, 0 errors, 0 warnings, 0 section mismatches -------------------------------------------------------------------------------- sama5_defconfig (arm, gcc-10) — PASS, 0 errors, 0 warnings, 0 section mismatches -------------------------------------------------------------------------------- sama7_defconfig (arm, gcc-10) — PASS, 0 errors, 0 warnings, 0 section mismatches -------------------------------------------------------------------------------- sb1250_swarm_defconfig (mips, gcc-10) — PASS, 0 errors, 0 warnings, 0 section mismatches -------------------------------------------------------------------------------- shannon_defconfig (arm, gcc-10) — PASS, 0 errors, 0 warnings, 0 section mismatches -------------------------------------------------------------------------------- shmobile_defconfig (arm, gcc-10) — PASS, 0 errors, 0 warnings, 0 section mismatches -------------------------------------------------------------------------------- simpad_defconfig (arm, gcc-10) — PASS, 0 errors, 0 warnings, 0 section mismatches -------------------------------------------------------------------------------- socfpga_defconfig (arm, gcc-10) — PASS, 0 errors, 0 warnings, 0 section mismatches -------------------------------------------------------------------------------- spear13xx_defconfig (arm, gcc-10) — PASS, 0 errors, 0 warnings, 0 section mismatches -------------------------------------------------------------------------------- spear3xx_defconfig (arm, gcc-10) — PASS, 0 errors, 0 warnings, 0 section mismatches -------------------------------------------------------------------------------- spear6xx_defconfig (arm, gcc-10) — PASS, 0 errors, 0 warnings, 0 section mismatches -------------------------------------------------------------------------------- spitz_defconfig (arm, gcc-10) — PASS, 0 errors, 0 warnings, 0 section mismatches -------------------------------------------------------------------------------- stm32_defconfig (arm, gcc-10) — PASS, 0 errors, 0 warnings, 0 section mismatches -------------------------------------------------------------------------------- sunxi_defconfig (arm, gcc-10) — PASS, 0 errors, 0 warnings, 0 section mismatches -------------------------------------------------------------------------------- tb0219_defconfig (mips, gcc-10) — PASS, 0 errors, 0 warnings, 0 section mismatches -------------------------------------------------------------------------------- tb0226_defconfig (mips, gcc-10) — PASS, 0 errors, 0 warnings, 0 section mismatches -------------------------------------------------------------------------------- tb0287_defconfig (mips, gcc-10) — PASS, 0 errors, 0 warnings, 0 section mismatches -------------------------------------------------------------------------------- tct_hammer_defconfig (arm, gcc-10) — PASS, 0 errors, 0 warnings, 0 section mismatches -------------------------------------------------------------------------------- tegra_defconfig (arm, gcc-10) — PASS, 0 errors, 0 warnings, 0 section mismatches -------------------------------------------------------------------------------- tinyconfig (i386, gcc-10) — PASS, 0 errors, 0 warnings, 0 section mismatches -------------------------------------------------------------------------------- tinyconfig (x86_64, gcc-10) — PASS, 0 errors, 0 warnings, 0 section mismatches -------------------------------------------------------------------------------- tinyconfig (arc, gcc-10) — PASS, 0 errors, 1 warning, 0 section mismatches Warnings: arch/arc/Makefile:26: ** WARNING ** CONFIG_ARC_TUNE_MCPU flag '' is unknown, fallback to '' -------------------------------------------------------------------------------- trizeps4_defconfig (arm, gcc-10) — PASS, 0 errors, 0 warnings, 0 section mismatches -------------------------------------------------------------------------------- u8500_defconfig (arm, gcc-10) — PASS, 0 errors, 0 warnings, 0 section mismatches -------------------------------------------------------------------------------- vdk_hs38_defconfig (arc, gcc-10) — PASS, 0 errors, 0 warnings, 0 section mismatches -------------------------------------------------------------------------------- vdk_hs38_smp_defconfig (arc, gcc-10) — PASS, 0 errors, 0 warnings, 0 section mismatches -------------------------------------------------------------------------------- versatile_defconfig (arm, gcc-10) — PASS, 0 errors, 0 warnings, 0 section mismatches -------------------------------------------------------------------------------- vexpress_defconfig (arm, gcc-10) — PASS, 0 errors, 0 warnings, 0 section mismatches -------------------------------------------------------------------------------- vf610m4_defconfig (arm, gcc-10) — PASS, 0 errors, 0 warnings, 0 section mismatches -------------------------------------------------------------------------------- viper_defconfig (arm, gcc-10) — PASS, 0 errors, 0 warnings, 0 section mismatches -------------------------------------------------------------------------------- vocore2_defconfig (mips, gcc-10) — PASS, 0 errors, 0 warnings, 0 section mismatches -------------------------------------------------------------------------------- vt8500_v6_v7_defconfig (arm, gcc-10) — PASS, 0 errors, 0 warnings, 0 section mismatches -------------------------------------------------------------------------------- workpad_defconfig (mips, gcc-10) — PASS, 0 errors, 0 warnings, 0 section mismatches -------------------------------------------------------------------------------- x86_64_defconfig (x86_64, gcc-10) — PASS, 0 errors, 0 warnings, 0 section mismatches -------------------------------------------------------------------------------- x86_64_defconfig+crypto (x86_64, gcc-10) — PASS, 0 errors, 0 warnings, 0 section mismatches -------------------------------------------------------------------------------- x86_64_defconfig+ima (x86_64, gcc-10) — PASS, 0 errors, 0 warnings, 0 section mismatches -------------------------------------------------------------------------------- x86_64_defconfig+kselftest (x86_64, gcc-10) — PASS, 0 errors, 0 warnings, 0 section mismatches -------------------------------------------------------------------------------- x86_64_defconfig+x86-chromebook (x86_64, gcc-10) — PASS, 0 errors, 0 warnings, 0 section mismatches -------------------------------------------------------------------------------- x86_64_defconfig+x86-chromebook+kselftest (x86_64, gcc-10) — PASS, 0 errors, 0 warnings, 0 section mismatches -------------------------------------------------------------------------------- x86_64_defconfig+x86_kvm_guest (x86_64, gcc-10) — PASS, 0 errors, 0 warnings, 0 section mismatches -------------------------------------------------------------------------------- xcep_defconfig (arm, gcc-10) — PASS, 0 errors, 0 warnings, 0 section mismatches -------------------------------------------------------------------------------- zeus_defconfig (arm, gcc-10) — PASS, 0 errors, 0 warnings, 0 section mismatches --- For more info write to <info(a)kernelci.org>
3 years, 4 months
1
0
0
0
stable-rc/queue/5.4 baseline: 131 runs, 1 regressions (v5.4.155-57-g682a02fc84db)
by kernelci.org bot
stable-rc/queue/5.4 baseline: 131 runs, 1 regressions (v5.4.155-57-g682a02fc84db) Regressions Summary ------------------- platform | arch | lab | compiler | defconfig | regressions ----------+-------+---------------+----------+-----------+------------ hip07-d05 | arm64 | lab-collabora | gcc-10 | defconfig | 1 Details:
https://kernelci.org/test/job/stable-rc/branch/queue%2F5.4/kernel/v5.4.155-…
Test: baseline Tree: stable-rc Branch: queue/5.4 Describe: v5.4.155-57-g682a02fc84db URL:
https://git.kernel.org/pub/scm/linux/kernel/git/stable/linux-stable-rc.git
SHA: 682a02fc84db08216631e08c934c73c00a78bba2 Test Regressions ---------------- platform | arch | lab | compiler | defconfig | regressions ----------+-------+---------------+----------+-----------+------------ hip07-d05 | arm64 | lab-collabora | gcc-10 | defconfig | 1 Details:
https://kernelci.org/test/plan/id/6178670bb50a0b85f533590f
Results: 0 PASS, 1 FAIL, 0 SKIP Full config: defconfig Compiler: gcc-10 (aarch64-linux-gnu-gcc (Debian 10.2.1-6) 10.2.1 20210110) Plain log:
https://storage.kernelci.org//stable-rc/queue-5.4/v5.4.155-57-g682a02fc84db…
HTML log:
https://storage.kernelci.org//stable-rc/queue-5.4/v5.4.155-57-g682a02fc84db…
Rootfs:
http://storage.kernelci.org/images/rootfs/buildroot/kci-2020.05-6-g8983f3b7…
* baseline.login:
https://kernelci.org/test/case/id/6178670bb50a0b85f5335910
new failure (last pass: v5.4.155-56-g13177975f7b1)
3 years, 4 months
1
0
0
0
net-next/master build: 202 builds: 6 failed, 196 passed, 6 errors, 10 warnings (v5.15-rc6-1937-g06338ceff925)
by kernelci.org bot
net-next/master build: 202 builds: 6 failed, 196 passed, 6 errors, 10 warnings (v5.15-rc6-1937-g06338ceff925) Full Build Summary:
https://kernelci.org/build/net-next/branch/master/kernel/v5.15-rc6-1937-g06…
Tree: net-next Branch: master Git Describe: v5.15-rc6-1937-g06338ceff925 Git Commit: 06338ceff92510544a732380dbb2d621bd3775bf Git URL:
https://git.kernel.org/pub/scm/linux/kernel/git/netdev/net-next.git
Built: 7 unique architectures Build Failures Detected: arm: rpc_defconfig: (gcc-10) FAIL mips: decstation_64_defconfig: (gcc-10) FAIL ip27_defconfig: (gcc-10) FAIL ip28_defconfig: (gcc-10) FAIL lemote2f_defconfig: (gcc-10) FAIL xway_defconfig: (gcc-10) FAIL Errors and Warnings Detected: arc: haps_hs_smp_defconfig+kselftest (gcc-10): 3 warnings tinyconfig (gcc-10): 1 warning arm64: arm: rpc_defconfig (gcc-10): 4 errors i386: mips: 32r2el_defconfig (gcc-10): 1 warning 32r2el_defconfig+kselftest (gcc-10): 1 warning rm200_defconfig (gcc-10): 1 warning xway_defconfig (gcc-10): 2 errors, 3 warnings riscv: x86_64: Errors summary: 2 arm-linux-gnueabihf-gcc: error: unrecognized -march target: armv3m 2 arm-linux-gnueabihf-gcc: error: missing argument to ‘-march=’ 1 drivers/net/ethernet/lantiq_etop.c:673:8: error: implicit declaration of function ‘device_property_read_u32’ [-Werror=implicit-function-declaration] 1 drivers/net/ethernet/lantiq_etop.c:265:55: error: ‘rx_burst_len’ undeclared (first use in this function) Warnings summary: 2 arch/mips/boot/dts/img/boston.dts:128.19-178.5: Warning (pci_device_reg): /pci@14000000/pci2_root@0,0,0: PCI unit address format error, expected "0,0" 2 arch/arc/Makefile:26: ** WARNING ** CONFIG_ARC_TUNE_MCPU flag '' is unknown, fallback to '' 1 drivers/net/ethernet/lantiq_etop.c:284:4: warning: ignoring return value of ‘request_irq’ declared with attribute ‘warn_unused_result’ [-Wunused-result] 1 drivers/net/ethernet/lantiq_etop.c:276:4: warning: ignoring return value of ‘request_irq’ declared with attribute ‘warn_unused_result’ [-Wunused-result] 1 drivers/block/paride/bpck.c:32: warning: "PC" redefined 1 cc1: some warnings being treated as errors 1 arch/arc/include/asm/perf_event.h:91:27: warning: 'arc_pmu_ev_hw_map' defined but not used [-Wunused-const-variable=] 1 arch/arc/include/asm/perf_event.h:126:27: warning: 'arc_pmu_cache_map' defined but not used [-Wunused-const-variable=] ================================================================================ Detailed per-defconfig build reports: -------------------------------------------------------------------------------- 32r2el_defconfig (mips, gcc-10) — PASS, 0 errors, 1 warning, 0 section mismatches Warnings: arch/mips/boot/dts/img/boston.dts:128.19-178.5: Warning (pci_device_reg): /pci@14000000/pci2_root@0,0,0: PCI unit address format error, expected "0,0" -------------------------------------------------------------------------------- 32r2el_defconfig+kselftest (mips, gcc-10) — PASS, 0 errors, 1 warning, 0 section mismatches Warnings: arch/mips/boot/dts/img/boston.dts:128.19-178.5: Warning (pci_device_reg): /pci@14000000/pci2_root@0,0,0: PCI unit address format error, expected "0,0" -------------------------------------------------------------------------------- allmodconfig (arm64, gcc-10) — PASS, 0 errors, 0 warnings, 0 section mismatches -------------------------------------------------------------------------------- allnoconfig (x86_64, gcc-10) — PASS, 0 errors, 0 warnings, 0 section mismatches -------------------------------------------------------------------------------- allnoconfig (arc, gcc-10) — PASS, 0 errors, 0 warnings, 0 section mismatches -------------------------------------------------------------------------------- allnoconfig (i386, gcc-10) — PASS, 0 errors, 0 warnings, 0 section mismatches -------------------------------------------------------------------------------- am200epdkit_defconfig (arm, gcc-10) — PASS, 0 errors, 0 warnings, 0 section mismatches -------------------------------------------------------------------------------- ar7_defconfig (mips, gcc-10) — PASS, 0 errors, 0 warnings, 0 section mismatches -------------------------------------------------------------------------------- aspeed_g4_defconfig (arm, gcc-10) — PASS, 0 errors, 0 warnings, 0 section mismatches -------------------------------------------------------------------------------- aspeed_g5_defconfig (arm, gcc-10) — PASS, 0 errors, 0 warnings, 0 section mismatches -------------------------------------------------------------------------------- assabet_defconfig (arm, gcc-10) — PASS, 0 errors, 0 warnings, 0 section mismatches -------------------------------------------------------------------------------- at91_dt_defconfig (arm, gcc-10) — PASS, 0 errors, 0 warnings, 0 section mismatches -------------------------------------------------------------------------------- ath25_defconfig (mips, gcc-10) — PASS, 0 errors, 0 warnings, 0 section mismatches -------------------------------------------------------------------------------- ath79_defconfig (mips, gcc-10) — PASS, 0 errors, 0 warnings, 0 section mismatches -------------------------------------------------------------------------------- axm55xx_defconfig (arm, gcc-10) — PASS, 0 errors, 0 warnings, 0 section mismatches -------------------------------------------------------------------------------- axs103_defconfig (arc, gcc-10) — PASS, 0 errors, 0 warnings, 0 section mismatches -------------------------------------------------------------------------------- axs103_smp_defconfig (arc, gcc-10) — PASS, 0 errors, 0 warnings, 0 section mismatches -------------------------------------------------------------------------------- badge4_defconfig (arm, gcc-10) — PASS, 0 errors, 0 warnings, 0 section mismatches -------------------------------------------------------------------------------- bcm2835_defconfig (arm, gcc-10) — PASS, 0 errors, 0 warnings, 0 section mismatches -------------------------------------------------------------------------------- bcm47xx_defconfig (mips, gcc-10) — PASS, 0 errors, 0 warnings, 0 section mismatches -------------------------------------------------------------------------------- bcm63xx_defconfig (mips, gcc-10) — PASS, 0 errors, 0 warnings, 0 section mismatches -------------------------------------------------------------------------------- bigsur_defconfig (mips, gcc-10) — PASS, 0 errors, 0 warnings, 0 section mismatches -------------------------------------------------------------------------------- bmips_be_defconfig (mips, gcc-10) — PASS, 0 errors, 0 warnings, 0 section mismatches -------------------------------------------------------------------------------- bmips_stb_defconfig (mips, gcc-10) — PASS, 0 errors, 0 warnings, 0 section mismatches -------------------------------------------------------------------------------- capcella_defconfig (mips, gcc-10) — PASS, 0 errors, 0 warnings, 0 section mismatches -------------------------------------------------------------------------------- cavium_octeon_defconfig (mips, gcc-10) — PASS, 0 errors, 0 warnings, 0 section mismatches -------------------------------------------------------------------------------- cerfcube_defconfig (arm, gcc-10) — PASS, 0 errors, 0 warnings, 0 section mismatches -------------------------------------------------------------------------------- ci20_defconfig (mips, gcc-10) — PASS, 0 errors, 0 warnings, 0 section mismatches -------------------------------------------------------------------------------- cm_x300_defconfig (arm, gcc-10) — PASS, 0 errors, 0 warnings, 0 section mismatches -------------------------------------------------------------------------------- cobalt_defconfig (mips, gcc-10) — PASS, 0 errors, 0 warnings, 0 section mismatches -------------------------------------------------------------------------------- colibri_pxa270_defconfig (arm, gcc-10) — PASS, 0 errors, 0 warnings, 0 section mismatches -------------------------------------------------------------------------------- colibri_pxa300_defconfig (arm, gcc-10) — PASS, 0 errors, 0 warnings, 0 section mismatches -------------------------------------------------------------------------------- collie_defconfig (arm, gcc-10) — PASS, 0 errors, 0 warnings, 0 section mismatches -------------------------------------------------------------------------------- corgi_defconfig (arm, gcc-10) — PASS, 0 errors, 0 warnings, 0 section mismatches -------------------------------------------------------------------------------- cu1000-neo_defconfig (mips, gcc-10) — PASS, 0 errors, 0 warnings, 0 section mismatches -------------------------------------------------------------------------------- cu1830-neo_defconfig (mips, gcc-10) — PASS, 0 errors, 0 warnings, 0 section mismatches -------------------------------------------------------------------------------- davinci_all_defconfig (arm, gcc-10) — PASS, 0 errors, 0 warnings, 0 section mismatches -------------------------------------------------------------------------------- db1xxx_defconfig (mips, gcc-10) — PASS, 0 errors, 0 warnings, 0 section mismatches -------------------------------------------------------------------------------- decstation_64_defconfig (mips, gcc-10) — FAIL, 0 errors, 0 warnings, 0 section mismatches -------------------------------------------------------------------------------- decstation_defconfig (mips, gcc-10) — PASS, 0 errors, 0 warnings, 0 section mismatches -------------------------------------------------------------------------------- decstation_r4k_defconfig (mips, gcc-10) — PASS, 0 errors, 0 warnings, 0 section mismatches -------------------------------------------------------------------------------- defconfig (riscv, gcc-10) — PASS, 0 errors, 0 warnings, 0 section mismatches -------------------------------------------------------------------------------- defconfig (arm64, gcc-10) — PASS, 0 errors, 0 warnings, 0 section mismatches -------------------------------------------------------------------------------- defconfig+CONFIG_CPU_BIG_ENDIAN=y (arm64, gcc-10) — PASS, 0 errors, 0 warnings, 0 section mismatches -------------------------------------------------------------------------------- defconfig+CONFIG_RANDOMIZE_BASE=y (arm64, gcc-10) — PASS, 0 errors, 0 warnings, 0 section mismatches -------------------------------------------------------------------------------- defconfig+crypto (arm64, gcc-10) — PASS, 0 errors, 0 warnings, 0 section mismatches -------------------------------------------------------------------------------- defconfig+ima (arm64, gcc-10) — PASS, 0 errors, 0 warnings, 0 section mismatches -------------------------------------------------------------------------------- defconfig+kselftest (riscv, gcc-10) — PASS, 0 errors, 0 warnings, 0 section mismatches -------------------------------------------------------------------------------- defconfig+kselftest (arm64, gcc-10) — PASS, 0 errors, 0 warnings, 0 section mismatches -------------------------------------------------------------------------------- dove_defconfig (arm, gcc-10) — PASS, 0 errors, 0 warnings, 0 section mismatches -------------------------------------------------------------------------------- e55_defconfig (mips, gcc-10) — PASS, 0 errors, 0 warnings, 0 section mismatches -------------------------------------------------------------------------------- ep93xx_defconfig (arm, gcc-10) — PASS, 0 errors, 0 warnings, 0 section mismatches -------------------------------------------------------------------------------- eseries_pxa_defconfig (arm, gcc-10) — PASS, 0 errors, 0 warnings, 0 section mismatches -------------------------------------------------------------------------------- exynos_defconfig (arm, gcc-10) — PASS, 0 errors, 0 warnings, 0 section mismatches -------------------------------------------------------------------------------- ezx_defconfig (arm, gcc-10) — PASS, 0 errors, 0 warnings, 0 section mismatches -------------------------------------------------------------------------------- footbridge_defconfig (arm, gcc-10) — PASS, 0 errors, 0 warnings, 0 section mismatches -------------------------------------------------------------------------------- fuloong2e_defconfig (mips, gcc-10) — PASS, 0 errors, 0 warnings, 0 section mismatches -------------------------------------------------------------------------------- gcw0_defconfig (mips, gcc-10) — PASS, 0 errors, 0 warnings, 0 section mismatches -------------------------------------------------------------------------------- gemini_defconfig (arm, gcc-10) — PASS, 0 errors, 0 warnings, 0 section mismatches -------------------------------------------------------------------------------- gpr_defconfig (mips, gcc-10) — PASS, 0 errors, 0 warnings, 0 section mismatches -------------------------------------------------------------------------------- h3600_defconfig (arm, gcc-10) — PASS, 0 errors, 0 warnings, 0 section mismatches -------------------------------------------------------------------------------- h5000_defconfig (arm, gcc-10) — PASS, 0 errors, 0 warnings, 0 section mismatches -------------------------------------------------------------------------------- hackkit_defconfig (arm, gcc-10) — PASS, 0 errors, 0 warnings, 0 section mismatches -------------------------------------------------------------------------------- haps_hs_defconfig (arc, gcc-10) — PASS, 0 errors, 0 warnings, 0 section mismatches -------------------------------------------------------------------------------- haps_hs_smp_defconfig (arc, gcc-10) — PASS, 0 errors, 0 warnings, 0 section mismatches -------------------------------------------------------------------------------- haps_hs_smp_defconfig+kselftest (arc, gcc-10) — PASS, 0 errors, 3 warnings, 0 section mismatches Warnings: arch/arc/Makefile:26: ** WARNING ** CONFIG_ARC_TUNE_MCPU flag '' is unknown, fallback to '' arch/arc/include/asm/perf_event.h:126:27: warning: 'arc_pmu_cache_map' defined but not used [-Wunused-const-variable=] arch/arc/include/asm/perf_event.h:91:27: warning: 'arc_pmu_ev_hw_map' defined but not used [-Wunused-const-variable=] -------------------------------------------------------------------------------- hisi_defconfig (arm, gcc-10) — PASS, 0 errors, 0 warnings, 0 section mismatches -------------------------------------------------------------------------------- hsdk_defconfig (arc, gcc-10) — PASS, 0 errors, 0 warnings, 0 section mismatches -------------------------------------------------------------------------------- i386_defconfig (i386, gcc-10) — PASS, 0 errors, 0 warnings, 0 section mismatches -------------------------------------------------------------------------------- i386_defconfig+kselftest (i386, gcc-10) — PASS, 0 errors, 0 warnings, 0 section mismatches -------------------------------------------------------------------------------- imote2_defconfig (arm, gcc-10) — PASS, 0 errors, 0 warnings, 0 section mismatches -------------------------------------------------------------------------------- imx_v4_v5_defconfig (arm, gcc-10) — PASS, 0 errors, 0 warnings, 0 section mismatches -------------------------------------------------------------------------------- imx_v6_v7_defconfig (arm, gcc-10) — PASS, 0 errors, 0 warnings, 0 section mismatches -------------------------------------------------------------------------------- integrator_defconfig (arm, gcc-10) — PASS, 0 errors, 0 warnings, 0 section mismatches -------------------------------------------------------------------------------- iop32x_defconfig (arm, gcc-10) — PASS, 0 errors, 0 warnings, 0 section mismatches -------------------------------------------------------------------------------- ip22_defconfig (mips, gcc-10) — PASS, 0 errors, 0 warnings, 0 section mismatches -------------------------------------------------------------------------------- ip27_defconfig (mips, gcc-10) — FAIL, 0 errors, 0 warnings, 0 section mismatches -------------------------------------------------------------------------------- ip28_defconfig (mips, gcc-10) — FAIL, 0 errors, 0 warnings, 0 section mismatches -------------------------------------------------------------------------------- ip32_defconfig (mips, gcc-10) — PASS, 0 errors, 0 warnings, 0 section mismatches -------------------------------------------------------------------------------- ixp4xx_defconfig (arm, gcc-10) — PASS, 0 errors, 0 warnings, 0 section mismatches -------------------------------------------------------------------------------- jazz_defconfig (mips, gcc-10) — PASS, 0 errors, 0 warnings, 0 section mismatches -------------------------------------------------------------------------------- jmr3927_defconfig (mips, gcc-10) — PASS, 0 errors, 0 warnings, 0 section mismatches -------------------------------------------------------------------------------- jornada720_defconfig (arm, gcc-10) — PASS, 0 errors, 0 warnings, 0 section mismatches -------------------------------------------------------------------------------- keystone_defconfig (arm, gcc-10) — PASS, 0 errors, 0 warnings, 0 section mismatches -------------------------------------------------------------------------------- lart_defconfig (arm, gcc-10) — PASS, 0 errors, 0 warnings, 0 section mismatches -------------------------------------------------------------------------------- lemote2f_defconfig (mips, gcc-10) — FAIL, 0 errors, 0 warnings, 0 section mismatches -------------------------------------------------------------------------------- loongson1b_defconfig (mips, gcc-10) — PASS, 0 errors, 0 warnings, 0 section mismatches -------------------------------------------------------------------------------- loongson1c_defconfig (mips, gcc-10) — PASS, 0 errors, 0 warnings, 0 section mismatches -------------------------------------------------------------------------------- loongson2k_defconfig (mips, gcc-10) — PASS, 0 errors, 0 warnings, 0 section mismatches -------------------------------------------------------------------------------- loongson3_defconfig (mips, gcc-10) — PASS, 0 errors, 0 warnings, 0 section mismatches -------------------------------------------------------------------------------- lpc18xx_defconfig (arm, gcc-10) — PASS, 0 errors, 0 warnings, 0 section mismatches -------------------------------------------------------------------------------- lpc32xx_defconfig (arm, gcc-10) — PASS, 0 errors, 0 warnings, 0 section mismatches -------------------------------------------------------------------------------- lpd270_defconfig (arm, gcc-10) — PASS, 0 errors, 0 warnings, 0 section mismatches -------------------------------------------------------------------------------- lubbock_defconfig (arm, gcc-10) — PASS, 0 errors, 0 warnings, 0 section mismatches -------------------------------------------------------------------------------- magician_defconfig (arm, gcc-10) — PASS, 0 errors, 0 warnings, 0 section mismatches -------------------------------------------------------------------------------- mainstone_defconfig (arm, gcc-10) — PASS, 0 errors, 0 warnings, 0 section mismatches -------------------------------------------------------------------------------- malta_defconfig (mips, gcc-10) — PASS, 0 errors, 0 warnings, 0 section mismatches -------------------------------------------------------------------------------- malta_kvm_defconfig (mips, gcc-10) — PASS, 0 errors, 0 warnings, 0 section mismatches -------------------------------------------------------------------------------- malta_qemu_32r6_defconfig (mips, gcc-10) — PASS, 0 errors, 0 warnings, 0 section mismatches -------------------------------------------------------------------------------- maltaaprp_defconfig (mips, gcc-10) — PASS, 0 errors, 0 warnings, 0 section mismatches -------------------------------------------------------------------------------- maltasmvp_defconfig (mips, gcc-10) — PASS, 0 errors, 0 warnings, 0 section mismatches -------------------------------------------------------------------------------- maltasmvp_eva_defconfig (mips, gcc-10) — PASS, 0 errors, 0 warnings, 0 section mismatches -------------------------------------------------------------------------------- maltaup_defconfig (mips, gcc-10) — PASS, 0 errors, 0 warnings, 0 section mismatches -------------------------------------------------------------------------------- maltaup_xpa_defconfig (mips, gcc-10) — PASS, 0 errors, 0 warnings, 0 section mismatches -------------------------------------------------------------------------------- milbeaut_m10v_defconfig (arm, gcc-10) — PASS, 0 errors, 0 warnings, 0 section mismatches -------------------------------------------------------------------------------- mini2440_defconfig (arm, gcc-10) — PASS, 0 errors, 0 warnings, 0 section mismatches -------------------------------------------------------------------------------- mmp2_defconfig (arm, gcc-10) — PASS, 0 errors, 0 warnings, 0 section mismatches -------------------------------------------------------------------------------- moxart_defconfig (arm, gcc-10) — PASS, 0 errors, 0 warnings, 0 section mismatches -------------------------------------------------------------------------------- mpc30x_defconfig (mips, gcc-10) — PASS, 0 errors, 0 warnings, 0 section mismatches -------------------------------------------------------------------------------- mps2_defconfig (arm, gcc-10) — PASS, 0 errors, 0 warnings, 0 section mismatches -------------------------------------------------------------------------------- mtx1_defconfig (mips, gcc-10) — PASS, 0 errors, 0 warnings, 0 section mismatches -------------------------------------------------------------------------------- multi_v4t_defconfig (arm, gcc-10) — PASS, 0 errors, 0 warnings, 0 section mismatches -------------------------------------------------------------------------------- multi_v5_defconfig (arm, gcc-10) — PASS, 0 errors, 0 warnings, 0 section mismatches -------------------------------------------------------------------------------- multi_v7_defconfig (arm, gcc-10) — PASS, 0 errors, 0 warnings, 0 section mismatches -------------------------------------------------------------------------------- multi_v7_defconfig+CONFIG_CPU_BIG_ENDIAN=y (arm, gcc-10) — PASS, 0 errors, 0 warnings, 0 section mismatches -------------------------------------------------------------------------------- multi_v7_defconfig+CONFIG_EFI=y+CONFIG_ARM_LPAE=y (arm, gcc-10) — PASS, 0 errors, 0 warnings, 0 section mismatches -------------------------------------------------------------------------------- multi_v7_defconfig+CONFIG_SMP=n (arm, gcc-10) — PASS, 0 errors, 0 warnings, 0 section mismatches -------------------------------------------------------------------------------- multi_v7_defconfig+CONFIG_THUMB2_KERNEL=y (arm, gcc-10) — PASS, 0 errors, 0 warnings, 0 section mismatches -------------------------------------------------------------------------------- multi_v7_defconfig+crypto (arm, gcc-10) — PASS, 0 errors, 0 warnings, 0 section mismatches -------------------------------------------------------------------------------- multi_v7_defconfig+ima (arm, gcc-10) — PASS, 0 errors, 0 warnings, 0 section mismatches -------------------------------------------------------------------------------- multi_v7_defconfig+kselftest (arm, gcc-10) — PASS, 0 errors, 0 warnings, 0 section mismatches -------------------------------------------------------------------------------- mvebu_v5_defconfig (arm, gcc-10) — PASS, 0 errors, 0 warnings, 0 section mismatches -------------------------------------------------------------------------------- mvebu_v7_defconfig (arm, gcc-10) — PASS, 0 errors, 0 warnings, 0 section mismatches -------------------------------------------------------------------------------- mxs_defconfig (arm, gcc-10) — PASS, 0 errors, 0 warnings, 0 section mismatches -------------------------------------------------------------------------------- neponset_defconfig (arm, gcc-10) — PASS, 0 errors, 0 warnings, 0 section mismatches -------------------------------------------------------------------------------- netwinder_defconfig (arm, gcc-10) — PASS, 0 errors, 0 warnings, 0 section mismatches -------------------------------------------------------------------------------- nhk8815_defconfig (arm, gcc-10) — PASS, 0 errors, 0 warnings, 0 section mismatches -------------------------------------------------------------------------------- nlm_xlp_defconfig (mips, gcc-10) — PASS, 0 errors, 0 warnings, 0 section mismatches -------------------------------------------------------------------------------- nlm_xlr_defconfig (mips, gcc-10) — PASS, 0 errors, 0 warnings, 0 section mismatches -------------------------------------------------------------------------------- nommu_k210_defconfig (riscv, gcc-10) — PASS, 0 errors, 0 warnings, 0 section mismatches -------------------------------------------------------------------------------- nommu_k210_sdcard_defconfig (riscv, gcc-10) — PASS, 0 errors, 0 warnings, 0 section mismatches -------------------------------------------------------------------------------- nsimosci_hs_defconfig (arc, gcc-10) — PASS, 0 errors, 0 warnings, 0 section mismatches -------------------------------------------------------------------------------- nsimosci_hs_smp_defconfig (arc, gcc-10) — PASS, 0 errors, 0 warnings, 0 section mismatches -------------------------------------------------------------------------------- omap1_defconfig (arm, gcc-10) — PASS, 0 errors, 0 warnings, 0 section mismatches -------------------------------------------------------------------------------- omap2plus_defconfig (arm, gcc-10) — PASS, 0 errors, 0 warnings, 0 section mismatches -------------------------------------------------------------------------------- omega2p_defconfig (mips, gcc-10) — PASS, 0 errors, 0 warnings, 0 section mismatches -------------------------------------------------------------------------------- orion5x_defconfig (arm, gcc-10) — PASS, 0 errors, 0 warnings, 0 section mismatches -------------------------------------------------------------------------------- oxnas_v6_defconfig (arm, gcc-10) — PASS, 0 errors, 0 warnings, 0 section mismatches -------------------------------------------------------------------------------- palmz72_defconfig (arm, gcc-10) — PASS, 0 errors, 0 warnings, 0 section mismatches -------------------------------------------------------------------------------- pcm027_defconfig (arm, gcc-10) — PASS, 0 errors, 0 warnings, 0 section mismatches -------------------------------------------------------------------------------- pic32mzda_defconfig (mips, gcc-10) — PASS, 0 errors, 0 warnings, 0 section mismatches -------------------------------------------------------------------------------- pleb_defconfig (arm, gcc-10) — PASS, 0 errors, 0 warnings, 0 section mismatches -------------------------------------------------------------------------------- pxa168_defconfig (arm, gcc-10) — PASS, 0 errors, 0 warnings, 0 section mismatches -------------------------------------------------------------------------------- pxa255-idp_defconfig (arm, gcc-10) — PASS, 0 errors, 0 warnings, 0 section mismatches -------------------------------------------------------------------------------- pxa3xx_defconfig (arm, gcc-10) — PASS, 0 errors, 0 warnings, 0 section mismatches -------------------------------------------------------------------------------- pxa910_defconfig (arm, gcc-10) — PASS, 0 errors, 0 warnings, 0 section mismatches -------------------------------------------------------------------------------- pxa_defconfig (arm, gcc-10) — PASS, 0 errors, 0 warnings, 0 section mismatches -------------------------------------------------------------------------------- qcom_defconfig (arm, gcc-10) — PASS, 0 errors, 0 warnings, 0 section mismatches -------------------------------------------------------------------------------- qi_lb60_defconfig (mips, gcc-10) — PASS, 0 errors, 0 warnings, 0 section mismatches -------------------------------------------------------------------------------- rb532_defconfig (mips, gcc-10) — PASS, 0 errors, 0 warnings, 0 section mismatches -------------------------------------------------------------------------------- rbtx49xx_defconfig (mips, gcc-10) — PASS, 0 errors, 0 warnings, 0 section mismatches -------------------------------------------------------------------------------- realview_defconfig (arm, gcc-10) — PASS, 0 errors, 0 warnings, 0 section mismatches -------------------------------------------------------------------------------- rm200_defconfig (mips, gcc-10) — PASS, 0 errors, 1 warning, 0 section mismatches Warnings: drivers/block/paride/bpck.c:32: warning: "PC" redefined -------------------------------------------------------------------------------- rpc_defconfig (arm, gcc-10) — FAIL, 4 errors, 0 warnings, 0 section mismatches Errors: arm-linux-gnueabihf-gcc: error: unrecognized -march target: armv3m arm-linux-gnueabihf-gcc: error: missing argument to ‘-march=’ arm-linux-gnueabihf-gcc: error: unrecognized -march target: armv3m arm-linux-gnueabihf-gcc: error: missing argument to ‘-march=’ -------------------------------------------------------------------------------- rs90_defconfig (mips, gcc-10) — PASS, 0 errors, 0 warnings, 0 section mismatches -------------------------------------------------------------------------------- rt305x_defconfig (mips, gcc-10) — PASS, 0 errors, 0 warnings, 0 section mismatches -------------------------------------------------------------------------------- rv32_defconfig (riscv, gcc-10) — PASS, 0 errors, 0 warnings, 0 section mismatches -------------------------------------------------------------------------------- s3c2410_defconfig (arm, gcc-10) — PASS, 0 errors, 0 warnings, 0 section mismatches -------------------------------------------------------------------------------- s3c6400_defconfig (arm, gcc-10) — PASS, 0 errors, 0 warnings, 0 section mismatches -------------------------------------------------------------------------------- s5pv210_defconfig (arm, gcc-10) — PASS, 0 errors, 0 warnings, 0 section mismatches -------------------------------------------------------------------------------- sama5_defconfig (arm, gcc-10) — PASS, 0 errors, 0 warnings, 0 section mismatches -------------------------------------------------------------------------------- sama7_defconfig (arm, gcc-10) — PASS, 0 errors, 0 warnings, 0 section mismatches -------------------------------------------------------------------------------- sb1250_swarm_defconfig (mips, gcc-10) — PASS, 0 errors, 0 warnings, 0 section mismatches -------------------------------------------------------------------------------- shannon_defconfig (arm, gcc-10) — PASS, 0 errors, 0 warnings, 0 section mismatches -------------------------------------------------------------------------------- shmobile_defconfig (arm, gcc-10) — PASS, 0 errors, 0 warnings, 0 section mismatches -------------------------------------------------------------------------------- simpad_defconfig (arm, gcc-10) — PASS, 0 errors, 0 warnings, 0 section mismatches -------------------------------------------------------------------------------- socfpga_defconfig (arm, gcc-10) — PASS, 0 errors, 0 warnings, 0 section mismatches -------------------------------------------------------------------------------- spear13xx_defconfig (arm, gcc-10) — PASS, 0 errors, 0 warnings, 0 section mismatches -------------------------------------------------------------------------------- spear3xx_defconfig (arm, gcc-10) — PASS, 0 errors, 0 warnings, 0 section mismatches -------------------------------------------------------------------------------- spear6xx_defconfig (arm, gcc-10) — PASS, 0 errors, 0 warnings, 0 section mismatches -------------------------------------------------------------------------------- spitz_defconfig (arm, gcc-10) — PASS, 0 errors, 0 warnings, 0 section mismatches -------------------------------------------------------------------------------- stm32_defconfig (arm, gcc-10) — PASS, 0 errors, 0 warnings, 0 section mismatches -------------------------------------------------------------------------------- sunxi_defconfig (arm, gcc-10) — PASS, 0 errors, 0 warnings, 0 section mismatches -------------------------------------------------------------------------------- tb0219_defconfig (mips, gcc-10) — PASS, 0 errors, 0 warnings, 0 section mismatches -------------------------------------------------------------------------------- tb0226_defconfig (mips, gcc-10) — PASS, 0 errors, 0 warnings, 0 section mismatches -------------------------------------------------------------------------------- tb0287_defconfig (mips, gcc-10) — PASS, 0 errors, 0 warnings, 0 section mismatches -------------------------------------------------------------------------------- tct_hammer_defconfig (arm, gcc-10) — PASS, 0 errors, 0 warnings, 0 section mismatches -------------------------------------------------------------------------------- tegra_defconfig (arm, gcc-10) — PASS, 0 errors, 0 warnings, 0 section mismatches -------------------------------------------------------------------------------- tinyconfig (arc, gcc-10) — PASS, 0 errors, 1 warning, 0 section mismatches Warnings: arch/arc/Makefile:26: ** WARNING ** CONFIG_ARC_TUNE_MCPU flag '' is unknown, fallback to '' -------------------------------------------------------------------------------- tinyconfig (x86_64, gcc-10) — PASS, 0 errors, 0 warnings, 0 section mismatches -------------------------------------------------------------------------------- tinyconfig (i386, gcc-10) — PASS, 0 errors, 0 warnings, 0 section mismatches -------------------------------------------------------------------------------- trizeps4_defconfig (arm, gcc-10) — PASS, 0 errors, 0 warnings, 0 section mismatches -------------------------------------------------------------------------------- u8500_defconfig (arm, gcc-10) — PASS, 0 errors, 0 warnings, 0 section mismatches -------------------------------------------------------------------------------- vdk_hs38_defconfig (arc, gcc-10) — PASS, 0 errors, 0 warnings, 0 section mismatches -------------------------------------------------------------------------------- vdk_hs38_smp_defconfig (arc, gcc-10) — PASS, 0 errors, 0 warnings, 0 section mismatches -------------------------------------------------------------------------------- versatile_defconfig (arm, gcc-10) — PASS, 0 errors, 0 warnings, 0 section mismatches -------------------------------------------------------------------------------- vexpress_defconfig (arm, gcc-10) — PASS, 0 errors, 0 warnings, 0 section mismatches -------------------------------------------------------------------------------- vf610m4_defconfig (arm, gcc-10) — PASS, 0 errors, 0 warnings, 0 section mismatches -------------------------------------------------------------------------------- viper_defconfig (arm, gcc-10) — PASS, 0 errors, 0 warnings, 0 section mismatches -------------------------------------------------------------------------------- vocore2_defconfig (mips, gcc-10) — PASS, 0 errors, 0 warnings, 0 section mismatches -------------------------------------------------------------------------------- vt8500_v6_v7_defconfig (arm, gcc-10) — PASS, 0 errors, 0 warnings, 0 section mismatches -------------------------------------------------------------------------------- workpad_defconfig (mips, gcc-10) — PASS, 0 errors, 0 warnings, 0 section mismatches -------------------------------------------------------------------------------- x86_64_defconfig (x86_64, gcc-10) — PASS, 0 errors, 0 warnings, 0 section mismatches -------------------------------------------------------------------------------- x86_64_defconfig+crypto (x86_64, gcc-10) — PASS, 0 errors, 0 warnings, 0 section mismatches -------------------------------------------------------------------------------- x86_64_defconfig+ima (x86_64, gcc-10) — PASS, 0 errors, 0 warnings, 0 section mismatches -------------------------------------------------------------------------------- x86_64_defconfig+kselftest (x86_64, gcc-10) — PASS, 0 errors, 0 warnings, 0 section mismatches -------------------------------------------------------------------------------- x86_64_defconfig+x86-chromebook (x86_64, gcc-10) — PASS, 0 errors, 0 warnings, 0 section mismatches -------------------------------------------------------------------------------- x86_64_defconfig+x86-chromebook+kselftest (x86_64, gcc-10) — PASS, 0 errors, 0 warnings, 0 section mismatches -------------------------------------------------------------------------------- x86_64_defconfig+x86_kvm_guest (x86_64, gcc-10) — PASS, 0 errors, 0 warnings, 0 section mismatches -------------------------------------------------------------------------------- xcep_defconfig (arm, gcc-10) — PASS, 0 errors, 0 warnings, 0 section mismatches -------------------------------------------------------------------------------- xway_defconfig (mips, gcc-10) — FAIL, 2 errors, 3 warnings, 0 section mismatches Errors: drivers/net/ethernet/lantiq_etop.c:265:55: error: ‘rx_burst_len’ undeclared (first use in this function) drivers/net/ethernet/lantiq_etop.c:673:8: error: implicit declaration of function ‘device_property_read_u32’ [-Werror=implicit-function-declaration] Warnings: drivers/net/ethernet/lantiq_etop.c:276:4: warning: ignoring return value of ‘request_irq’ declared with attribute ‘warn_unused_result’ [-Wunused-result] drivers/net/ethernet/lantiq_etop.c:284:4: warning: ignoring return value of ‘request_irq’ declared with attribute ‘warn_unused_result’ [-Wunused-result] cc1: some warnings being treated as errors -------------------------------------------------------------------------------- zeus_defconfig (arm, gcc-10) — PASS, 0 errors, 0 warnings, 0 section mismatches --- For more info write to <info(a)kernelci.org>
3 years, 4 months
1
0
0
0
soc/for-next baseline: 232 runs, 1 regressions (v5.15-rc6-1095-g2388cf9633f6)
by kernelci.org bot
soc/for-next baseline: 232 runs, 1 regressions (v5.15-rc6-1095-g2388cf9633f6) Regressions Summary ------------------- platform | arch | lab | compiler | defconfig | regressions -------------------+-------+-------------+----------+------------------------------+------------ kontron-pitx-imx8m | arm64 | lab-kontron | gcc-10 | defconfig+CON...OMIZE_BASE=y | 1 Details:
https://kernelci.org/test/job/soc/branch/for-next/kernel/v5.15-rc6-1095-g23…
Test: baseline Tree: soc Branch: for-next Describe: v5.15-rc6-1095-g2388cf9633f6 URL:
https://git.kernel.org/pub/scm/linux/kernel/git/soc/soc.git
SHA: 2388cf9633f67b270216e9cf490193fcbc8ff988 Test Regressions ---------------- platform | arch | lab | compiler | defconfig | regressions -------------------+-------+-------------+----------+------------------------------+------------ kontron-pitx-imx8m | arm64 | lab-kontron | gcc-10 | defconfig+CON...OMIZE_BASE=y | 1 Details:
https://kernelci.org/test/plan/id/617878310321228d7d33590d
Results: 0 PASS, 1 FAIL, 0 SKIP Full config: defconfig+CONFIG_RANDOMIZE_BASE=y Compiler: gcc-10 (aarch64-linux-gnu-gcc (Debian 10.2.1-6) 10.2.1 20210110) Plain log:
https://storage.kernelci.org//soc/for-next/v5.15-rc6-1095-g2388cf9633f6/arm…
HTML log:
https://storage.kernelci.org//soc/for-next/v5.15-rc6-1095-g2388cf9633f6/arm…
Rootfs:
http://storage.kernelci.org/images/rootfs/buildroot/kci-2020.05-6-g8983f3b7…
* baseline.login:
https://kernelci.org/test/case/id/617878310321228d7d33590e
new failure (last pass: v5.15-rc6-1013-ge81fc37cb99b)
3 years, 4 months
1
0
0
0
stable-rc/queue/5.14 baseline: 140 runs, 1 regressions (v5.14.14-168-g0a80e96e759b)
by kernelci.org bot
stable-rc/queue/5.14 baseline: 140 runs, 1 regressions (v5.14.14-168-g0a80e96e759b) Regressions Summary ------------------- platform | arch | lab | compiler | defconfig | regressions ----------+------+--------------+----------+---------------------+------------ beagle-xm | arm | lab-baylibre | gcc-10 | omap2plus_defconfig | 1 Details:
https://kernelci.org/test/job/stable-rc/branch/queue%2F5.14/kernel/v5.14.14…
Test: baseline Tree: stable-rc Branch: queue/5.14 Describe: v5.14.14-168-g0a80e96e759b URL:
https://git.kernel.org/pub/scm/linux/kernel/git/stable/linux-stable-rc.git
SHA: 0a80e96e759b96303788627aa5bcbc2443e7c8c7 Test Regressions ---------------- platform | arch | lab | compiler | defconfig | regressions ----------+------+--------------+----------+---------------------+------------ beagle-xm | arm | lab-baylibre | gcc-10 | omap2plus_defconfig | 1 Details:
https://kernelci.org/test/plan/id/61784e43705cd7664133590b
Results: 0 PASS, 1 FAIL, 0 SKIP Full config: omap2plus_defconfig Compiler: gcc-10 (arm-linux-gnueabihf-gcc (Debian 10.2.1-6) 10.2.1 20210110) Plain log:
https://storage.kernelci.org//stable-rc/queue-5.14/v5.14.14-168-g0a80e96e75…
HTML log:
https://storage.kernelci.org//stable-rc/queue-5.14/v5.14.14-168-g0a80e96e75…
Rootfs:
http://storage.kernelci.org/images/rootfs/buildroot/kci-2020.05-6-g8983f3b7…
* baseline.login:
https://kernelci.org/test/case/id/61784e43705cd7664133590c
failing since 2 days (last pass: v5.14.14-64-gb66eb77f69e4, first fail: v5.14.14-124-g710e5bbf51e3)
3 years, 4 months
1
0
0
0
stable-rc/queue/4.19 baseline: 120 runs, 1 regressions (v4.19.213-36-gb94013ec6bbb)
by kernelci.org bot
stable-rc/queue/4.19 baseline: 120 runs, 1 regressions (v4.19.213-36-gb94013ec6bbb) Regressions Summary ------------------- platform | arch | lab | compiler | defconfig | regressions ---------+------+---------------+----------+---------------------+------------ panda | arm | lab-collabora | gcc-10 | omap2plus_defconfig | 1 Details:
https://kernelci.org/test/job/stable-rc/branch/queue%2F4.19/kernel/v4.19.21…
Test: baseline Tree: stable-rc Branch: queue/4.19 Describe: v4.19.213-36-gb94013ec6bbb URL:
https://git.kernel.org/pub/scm/linux/kernel/git/stable/linux-stable-rc.git
SHA: b94013ec6bbbc1627a45925360e3c26e67616a06 Test Regressions ---------------- platform | arch | lab | compiler | defconfig | regressions ---------+------+---------------+----------+---------------------+------------ panda | arm | lab-collabora | gcc-10 | omap2plus_defconfig | 1 Details:
https://kernelci.org/test/plan/id/617846f503260b1a9c3358ed
Results: 5 PASS, 1 FAIL, 0 SKIP Full config: omap2plus_defconfig Compiler: gcc-10 (arm-linux-gnueabihf-gcc (Debian 10.2.1-6) 10.2.1 20210110) Plain log:
https://storage.kernelci.org//stable-rc/queue-4.19/v4.19.213-36-gb94013ec6b…
HTML log:
https://storage.kernelci.org//stable-rc/queue-4.19/v4.19.213-36-gb94013ec6b…
Rootfs:
http://storage.kernelci.org/images/rootfs/buildroot/kci-2020.05-6-g8983f3b7…
* baseline.dmesg.emerg:
https://kernelci.org/test/case/id/617846f503260b1a9c3358f0
new failure (last pass: v4.19.213-36-g72599f780657) 2 lines 2021-10-26T18:20:21.755654 <8>[ 21.110565] <LAVA_SIGNAL_TESTCASE TEST_CASE_ID=alert RESULT=pass UNITS=lines MEASUREMENT=0> 2021-10-26T18:20:21.799190 kern :emerg : BUG: spinlock bad magic on CPU#0, udevd/108 2021-10-26T18:20:21.808306 kern :emerg : lock: emif_lock+0x0/0xffffecfc [emif], .magic: 00000000, .owner: <none>/-1, .owner_cpu: 0 2021-10-26T18:20:21.822524 <8>[ 21.179443] <LAVA_SIGNAL_TESTCASE TEST_CASE_ID=emerg RESULT=fail UNITS=lines MEASUREMENT=2>
3 years, 4 months
1
0
0
0
soc/for-next build: 199 builds: 5 failed, 194 passed, 4 errors, 6 warnings (v5.15-rc6-1095-g2388cf9633f6)
by kernelci.org bot
soc/for-next build: 199 builds: 5 failed, 194 passed, 4 errors, 6 warnings (v5.15-rc6-1095-g2388cf9633f6) Full Build Summary:
https://kernelci.org/build/soc/branch/for-next/kernel/v5.15-rc6-1095-g2388c…
Tree: soc Branch: for-next Git Describe: v5.15-rc6-1095-g2388cf9633f6 Git Commit: 2388cf9633f67b270216e9cf490193fcbc8ff988 Git URL:
https://git.kernel.org/pub/scm/linux/kernel/git/soc/soc.git
Built: 7 unique architectures Build Failures Detected: arm: rpc_defconfig: (gcc-10) FAIL mips: decstation_64_defconfig: (gcc-10) FAIL ip27_defconfig: (gcc-10) FAIL ip28_defconfig: (gcc-10) FAIL lemote2f_defconfig: (gcc-10) FAIL Errors and Warnings Detected: arc: tinyconfig (gcc-10): 1 warning arm64: arm: rpc_defconfig (gcc-10): 4 errors i386: mips: 32r2el_defconfig (gcc-10): 1 warning 32r2el_defconfig+kselftest (gcc-10): 1 warning lemote2f_defconfig (gcc-10): 1 warning loongson2k_defconfig (gcc-10): 1 warning rm200_defconfig (gcc-10): 1 warning riscv: x86_64: Errors summary: 2 arm-linux-gnueabihf-gcc: error: unrecognized -march target: armv3m 2 arm-linux-gnueabihf-gcc: error: missing argument to ‘-march=’ Warnings summary: 2 net/mac80211/mlme.c:4345:1: warning: the frame size of 1200 bytes is larger than 1024 bytes [-Wframe-larger-than=] 2 arch/mips/boot/dts/img/boston.dts:128.19-178.5: Warning (pci_device_reg): /pci@14000000/pci2_root@0,0,0: PCI unit address format error, expected "0,0" 1 drivers/block/paride/bpck.c:32: warning: "PC" redefined 1 arch/arc/Makefile:26: ** WARNING ** CONFIG_ARC_TUNE_MCPU flag '' is unknown, fallback to '' ================================================================================ Detailed per-defconfig build reports: -------------------------------------------------------------------------------- 32r2el_defconfig (mips, gcc-10) — PASS, 0 errors, 1 warning, 0 section mismatches Warnings: arch/mips/boot/dts/img/boston.dts:128.19-178.5: Warning (pci_device_reg): /pci@14000000/pci2_root@0,0,0: PCI unit address format error, expected "0,0" -------------------------------------------------------------------------------- 32r2el_defconfig+kselftest (mips, gcc-10) — PASS, 0 errors, 1 warning, 0 section mismatches Warnings: arch/mips/boot/dts/img/boston.dts:128.19-178.5: Warning (pci_device_reg): /pci@14000000/pci2_root@0,0,0: PCI unit address format error, expected "0,0" -------------------------------------------------------------------------------- allmodconfig (arm64, gcc-10) — PASS, 0 errors, 0 warnings, 0 section mismatches -------------------------------------------------------------------------------- allnoconfig (i386, gcc-10) — PASS, 0 errors, 0 warnings, 0 section mismatches -------------------------------------------------------------------------------- allnoconfig (arc, gcc-10) — PASS, 0 errors, 0 warnings, 0 section mismatches -------------------------------------------------------------------------------- allnoconfig (x86_64, gcc-10) — PASS, 0 errors, 0 warnings, 0 section mismatches -------------------------------------------------------------------------------- am200epdkit_defconfig (arm, gcc-10) — PASS, 0 errors, 0 warnings, 0 section mismatches -------------------------------------------------------------------------------- ar7_defconfig (mips, gcc-10) — PASS, 0 errors, 0 warnings, 0 section mismatches -------------------------------------------------------------------------------- aspeed_g4_defconfig (arm, gcc-10) — PASS, 0 errors, 0 warnings, 0 section mismatches -------------------------------------------------------------------------------- aspeed_g5_defconfig (arm, gcc-10) — PASS, 0 errors, 0 warnings, 0 section mismatches -------------------------------------------------------------------------------- assabet_defconfig (arm, gcc-10) — PASS, 0 errors, 0 warnings, 0 section mismatches -------------------------------------------------------------------------------- at91_dt_defconfig (arm, gcc-10) — PASS, 0 errors, 0 warnings, 0 section mismatches -------------------------------------------------------------------------------- ath25_defconfig (mips, gcc-10) — PASS, 0 errors, 0 warnings, 0 section mismatches -------------------------------------------------------------------------------- ath79_defconfig (mips, gcc-10) — PASS, 0 errors, 0 warnings, 0 section mismatches -------------------------------------------------------------------------------- axm55xx_defconfig (arm, gcc-10) — PASS, 0 errors, 0 warnings, 0 section mismatches -------------------------------------------------------------------------------- axs103_defconfig (arc, gcc-10) — PASS, 0 errors, 0 warnings, 0 section mismatches -------------------------------------------------------------------------------- axs103_smp_defconfig (arc, gcc-10) — PASS, 0 errors, 0 warnings, 0 section mismatches -------------------------------------------------------------------------------- badge4_defconfig (arm, gcc-10) — PASS, 0 errors, 0 warnings, 0 section mismatches -------------------------------------------------------------------------------- bcm2835_defconfig (arm, gcc-10) — PASS, 0 errors, 0 warnings, 0 section mismatches -------------------------------------------------------------------------------- bcm47xx_defconfig (mips, gcc-10) — PASS, 0 errors, 0 warnings, 0 section mismatches -------------------------------------------------------------------------------- bcm63xx_defconfig (mips, gcc-10) — PASS, 0 errors, 0 warnings, 0 section mismatches -------------------------------------------------------------------------------- bigsur_defconfig (mips, gcc-10) — PASS, 0 errors, 0 warnings, 0 section mismatches -------------------------------------------------------------------------------- bmips_be_defconfig (mips, gcc-10) — PASS, 0 errors, 0 warnings, 0 section mismatches -------------------------------------------------------------------------------- bmips_stb_defconfig (mips, gcc-10) — PASS, 0 errors, 0 warnings, 0 section mismatches -------------------------------------------------------------------------------- capcella_defconfig (mips, gcc-10) — PASS, 0 errors, 0 warnings, 0 section mismatches -------------------------------------------------------------------------------- cavium_octeon_defconfig (mips, gcc-10) — PASS, 0 errors, 0 warnings, 0 section mismatches -------------------------------------------------------------------------------- cerfcube_defconfig (arm, gcc-10) — PASS, 0 errors, 0 warnings, 0 section mismatches -------------------------------------------------------------------------------- ci20_defconfig (mips, gcc-10) — PASS, 0 errors, 0 warnings, 0 section mismatches -------------------------------------------------------------------------------- cm_x300_defconfig (arm, gcc-10) — PASS, 0 errors, 0 warnings, 0 section mismatches -------------------------------------------------------------------------------- cobalt_defconfig (mips, gcc-10) — PASS, 0 errors, 0 warnings, 0 section mismatches -------------------------------------------------------------------------------- colibri_pxa270_defconfig (arm, gcc-10) — PASS, 0 errors, 0 warnings, 0 section mismatches -------------------------------------------------------------------------------- colibri_pxa300_defconfig (arm, gcc-10) — PASS, 0 errors, 0 warnings, 0 section mismatches -------------------------------------------------------------------------------- collie_defconfig (arm, gcc-10) — PASS, 0 errors, 0 warnings, 0 section mismatches -------------------------------------------------------------------------------- corgi_defconfig (arm, gcc-10) — PASS, 0 errors, 0 warnings, 0 section mismatches -------------------------------------------------------------------------------- cu1000-neo_defconfig (mips, gcc-10) — PASS, 0 errors, 0 warnings, 0 section mismatches -------------------------------------------------------------------------------- cu1830-neo_defconfig (mips, gcc-10) — PASS, 0 errors, 0 warnings, 0 section mismatches -------------------------------------------------------------------------------- davinci_all_defconfig (arm, gcc-10) — PASS, 0 errors, 0 warnings, 0 section mismatches -------------------------------------------------------------------------------- db1xxx_defconfig (mips, gcc-10) — PASS, 0 errors, 0 warnings, 0 section mismatches -------------------------------------------------------------------------------- decstation_64_defconfig (mips, gcc-10) — FAIL, 0 errors, 0 warnings, 0 section mismatches -------------------------------------------------------------------------------- decstation_defconfig (mips, gcc-10) — PASS, 0 errors, 0 warnings, 0 section mismatches -------------------------------------------------------------------------------- decstation_r4k_defconfig (mips, gcc-10) — PASS, 0 errors, 0 warnings, 0 section mismatches -------------------------------------------------------------------------------- defconfig (riscv, gcc-10) — PASS, 0 errors, 0 warnings, 0 section mismatches -------------------------------------------------------------------------------- defconfig (arm64, gcc-10) — PASS, 0 errors, 0 warnings, 0 section mismatches -------------------------------------------------------------------------------- defconfig+CONFIG_CPU_BIG_ENDIAN=y (arm64, gcc-10) — PASS, 0 errors, 0 warnings, 0 section mismatches -------------------------------------------------------------------------------- defconfig+CONFIG_RANDOMIZE_BASE=y (arm64, gcc-10) — PASS, 0 errors, 0 warnings, 0 section mismatches -------------------------------------------------------------------------------- defconfig+crypto (arm64, gcc-10) — PASS, 0 errors, 0 warnings, 0 section mismatches -------------------------------------------------------------------------------- defconfig+ima (arm64, gcc-10) — PASS, 0 errors, 0 warnings, 0 section mismatches -------------------------------------------------------------------------------- defconfig+kselftest (arm64, gcc-10) — PASS, 0 errors, 0 warnings, 0 section mismatches -------------------------------------------------------------------------------- defconfig+kselftest (riscv, gcc-10) — PASS, 0 errors, 0 warnings, 0 section mismatches -------------------------------------------------------------------------------- dove_defconfig (arm, gcc-10) — PASS, 0 errors, 0 warnings, 0 section mismatches -------------------------------------------------------------------------------- e55_defconfig (mips, gcc-10) — PASS, 0 errors, 0 warnings, 0 section mismatches -------------------------------------------------------------------------------- ep93xx_defconfig (arm, gcc-10) — PASS, 0 errors, 0 warnings, 0 section mismatches -------------------------------------------------------------------------------- eseries_pxa_defconfig (arm, gcc-10) — PASS, 0 errors, 0 warnings, 0 section mismatches -------------------------------------------------------------------------------- exynos_defconfig (arm, gcc-10) — PASS, 0 errors, 0 warnings, 0 section mismatches -------------------------------------------------------------------------------- ezx_defconfig (arm, gcc-10) — PASS, 0 errors, 0 warnings, 0 section mismatches -------------------------------------------------------------------------------- footbridge_defconfig (arm, gcc-10) — PASS, 0 errors, 0 warnings, 0 section mismatches -------------------------------------------------------------------------------- fuloong2e_defconfig (mips, gcc-10) — PASS, 0 errors, 0 warnings, 0 section mismatches -------------------------------------------------------------------------------- gcw0_defconfig (mips, gcc-10) — PASS, 0 errors, 0 warnings, 0 section mismatches -------------------------------------------------------------------------------- gemini_defconfig (arm, gcc-10) — PASS, 0 errors, 0 warnings, 0 section mismatches -------------------------------------------------------------------------------- gpr_defconfig (mips, gcc-10) — PASS, 0 errors, 0 warnings, 0 section mismatches -------------------------------------------------------------------------------- h3600_defconfig (arm, gcc-10) — PASS, 0 errors, 0 warnings, 0 section mismatches -------------------------------------------------------------------------------- h5000_defconfig (arm, gcc-10) — PASS, 0 errors, 0 warnings, 0 section mismatches -------------------------------------------------------------------------------- hackkit_defconfig (arm, gcc-10) — PASS, 0 errors, 0 warnings, 0 section mismatches -------------------------------------------------------------------------------- haps_hs_defconfig (arc, gcc-10) — PASS, 0 errors, 0 warnings, 0 section mismatches -------------------------------------------------------------------------------- haps_hs_smp_defconfig (arc, gcc-10) — PASS, 0 errors, 0 warnings, 0 section mismatches -------------------------------------------------------------------------------- hisi_defconfig (arm, gcc-10) — PASS, 0 errors, 0 warnings, 0 section mismatches -------------------------------------------------------------------------------- hsdk_defconfig (arc, gcc-10) — PASS, 0 errors, 0 warnings, 0 section mismatches -------------------------------------------------------------------------------- i386_defconfig (i386, gcc-10) — PASS, 0 errors, 0 warnings, 0 section mismatches -------------------------------------------------------------------------------- i386_defconfig+kselftest (i386, gcc-10) — PASS, 0 errors, 0 warnings, 0 section mismatches -------------------------------------------------------------------------------- imote2_defconfig (arm, gcc-10) — PASS, 0 errors, 0 warnings, 0 section mismatches -------------------------------------------------------------------------------- imx_v4_v5_defconfig (arm, gcc-10) — PASS, 0 errors, 0 warnings, 0 section mismatches -------------------------------------------------------------------------------- imx_v6_v7_defconfig (arm, gcc-10) — PASS, 0 errors, 0 warnings, 0 section mismatches -------------------------------------------------------------------------------- integrator_defconfig (arm, gcc-10) — PASS, 0 errors, 0 warnings, 0 section mismatches -------------------------------------------------------------------------------- iop32x_defconfig (arm, gcc-10) — PASS, 0 errors, 0 warnings, 0 section mismatches -------------------------------------------------------------------------------- ip22_defconfig (mips, gcc-10) — PASS, 0 errors, 0 warnings, 0 section mismatches -------------------------------------------------------------------------------- ip27_defconfig (mips, gcc-10) — FAIL, 0 errors, 0 warnings, 0 section mismatches -------------------------------------------------------------------------------- ip28_defconfig (mips, gcc-10) — FAIL, 0 errors, 0 warnings, 0 section mismatches -------------------------------------------------------------------------------- ip32_defconfig (mips, gcc-10) — PASS, 0 errors, 0 warnings, 0 section mismatches -------------------------------------------------------------------------------- ixp4xx_defconfig (arm, gcc-10) — PASS, 0 errors, 0 warnings, 0 section mismatches -------------------------------------------------------------------------------- jazz_defconfig (mips, gcc-10) — PASS, 0 errors, 0 warnings, 0 section mismatches -------------------------------------------------------------------------------- jmr3927_defconfig (mips, gcc-10) — PASS, 0 errors, 0 warnings, 0 section mismatches -------------------------------------------------------------------------------- jornada720_defconfig (arm, gcc-10) — PASS, 0 errors, 0 warnings, 0 section mismatches -------------------------------------------------------------------------------- keystone_defconfig (arm, gcc-10) — PASS, 0 errors, 0 warnings, 0 section mismatches -------------------------------------------------------------------------------- lart_defconfig (arm, gcc-10) — PASS, 0 errors, 0 warnings, 0 section mismatches -------------------------------------------------------------------------------- lemote2f_defconfig (mips, gcc-10) — FAIL, 0 errors, 1 warning, 0 section mismatches Warnings: net/mac80211/mlme.c:4345:1: warning: the frame size of 1200 bytes is larger than 1024 bytes [-Wframe-larger-than=] -------------------------------------------------------------------------------- loongson1b_defconfig (mips, gcc-10) — PASS, 0 errors, 0 warnings, 0 section mismatches -------------------------------------------------------------------------------- loongson1c_defconfig (mips, gcc-10) — PASS, 0 errors, 0 warnings, 0 section mismatches -------------------------------------------------------------------------------- loongson2k_defconfig (mips, gcc-10) — PASS, 0 errors, 1 warning, 0 section mismatches Warnings: net/mac80211/mlme.c:4345:1: warning: the frame size of 1200 bytes is larger than 1024 bytes [-Wframe-larger-than=] -------------------------------------------------------------------------------- loongson3_defconfig (mips, gcc-10) — PASS, 0 errors, 0 warnings, 0 section mismatches -------------------------------------------------------------------------------- lpc18xx_defconfig (arm, gcc-10) — PASS, 0 errors, 0 warnings, 0 section mismatches -------------------------------------------------------------------------------- lpc32xx_defconfig (arm, gcc-10) — PASS, 0 errors, 0 warnings, 0 section mismatches -------------------------------------------------------------------------------- lpd270_defconfig (arm, gcc-10) — PASS, 0 errors, 0 warnings, 0 section mismatches -------------------------------------------------------------------------------- lubbock_defconfig (arm, gcc-10) — PASS, 0 errors, 0 warnings, 0 section mismatches -------------------------------------------------------------------------------- magician_defconfig (arm, gcc-10) — PASS, 0 errors, 0 warnings, 0 section mismatches -------------------------------------------------------------------------------- mainstone_defconfig (arm, gcc-10) — PASS, 0 errors, 0 warnings, 0 section mismatches -------------------------------------------------------------------------------- malta_defconfig (mips, gcc-10) — PASS, 0 errors, 0 warnings, 0 section mismatches -------------------------------------------------------------------------------- malta_kvm_defconfig (mips, gcc-10) — PASS, 0 errors, 0 warnings, 0 section mismatches -------------------------------------------------------------------------------- malta_qemu_32r6_defconfig (mips, gcc-10) — PASS, 0 errors, 0 warnings, 0 section mismatches -------------------------------------------------------------------------------- maltaaprp_defconfig (mips, gcc-10) — PASS, 0 errors, 0 warnings, 0 section mismatches -------------------------------------------------------------------------------- maltasmvp_defconfig (mips, gcc-10) — PASS, 0 errors, 0 warnings, 0 section mismatches -------------------------------------------------------------------------------- maltasmvp_eva_defconfig (mips, gcc-10) — PASS, 0 errors, 0 warnings, 0 section mismatches -------------------------------------------------------------------------------- maltaup_defconfig (mips, gcc-10) — PASS, 0 errors, 0 warnings, 0 section mismatches -------------------------------------------------------------------------------- maltaup_xpa_defconfig (mips, gcc-10) — PASS, 0 errors, 0 warnings, 0 section mismatches -------------------------------------------------------------------------------- milbeaut_m10v_defconfig (arm, gcc-10) — PASS, 0 errors, 0 warnings, 0 section mismatches -------------------------------------------------------------------------------- mini2440_defconfig (arm, gcc-10) — PASS, 0 errors, 0 warnings, 0 section mismatches -------------------------------------------------------------------------------- mmp2_defconfig (arm, gcc-10) — PASS, 0 errors, 0 warnings, 0 section mismatches -------------------------------------------------------------------------------- moxart_defconfig (arm, gcc-10) — PASS, 0 errors, 0 warnings, 0 section mismatches -------------------------------------------------------------------------------- mpc30x_defconfig (mips, gcc-10) — PASS, 0 errors, 0 warnings, 0 section mismatches -------------------------------------------------------------------------------- mps2_defconfig (arm, gcc-10) — PASS, 0 errors, 0 warnings, 0 section mismatches -------------------------------------------------------------------------------- mtx1_defconfig (mips, gcc-10) — PASS, 0 errors, 0 warnings, 0 section mismatches -------------------------------------------------------------------------------- multi_v4t_defconfig (arm, gcc-10) — PASS, 0 errors, 0 warnings, 0 section mismatches -------------------------------------------------------------------------------- multi_v5_defconfig (arm, gcc-10) — PASS, 0 errors, 0 warnings, 0 section mismatches -------------------------------------------------------------------------------- multi_v7_defconfig (arm, gcc-10) — PASS, 0 errors, 0 warnings, 0 section mismatches -------------------------------------------------------------------------------- multi_v7_defconfig+CONFIG_CPU_BIG_ENDIAN=y (arm, gcc-10) — PASS, 0 errors, 0 warnings, 0 section mismatches -------------------------------------------------------------------------------- multi_v7_defconfig+CONFIG_EFI=y+CONFIG_ARM_LPAE=y (arm, gcc-10) — PASS, 0 errors, 0 warnings, 0 section mismatches -------------------------------------------------------------------------------- multi_v7_defconfig+CONFIG_SMP=n (arm, gcc-10) — PASS, 0 errors, 0 warnings, 0 section mismatches -------------------------------------------------------------------------------- multi_v7_defconfig+CONFIG_THUMB2_KERNEL=y (arm, gcc-10) — PASS, 0 errors, 0 warnings, 0 section mismatches -------------------------------------------------------------------------------- multi_v7_defconfig+crypto (arm, gcc-10) — PASS, 0 errors, 0 warnings, 0 section mismatches -------------------------------------------------------------------------------- multi_v7_defconfig+ima (arm, gcc-10) — PASS, 0 errors, 0 warnings, 0 section mismatches -------------------------------------------------------------------------------- multi_v7_defconfig+kselftest (arm, gcc-10) — PASS, 0 errors, 0 warnings, 0 section mismatches -------------------------------------------------------------------------------- mvebu_v5_defconfig (arm, gcc-10) — PASS, 0 errors, 0 warnings, 0 section mismatches -------------------------------------------------------------------------------- mvebu_v7_defconfig (arm, gcc-10) — PASS, 0 errors, 0 warnings, 0 section mismatches -------------------------------------------------------------------------------- mxs_defconfig (arm, gcc-10) — PASS, 0 errors, 0 warnings, 0 section mismatches -------------------------------------------------------------------------------- neponset_defconfig (arm, gcc-10) — PASS, 0 errors, 0 warnings, 0 section mismatches -------------------------------------------------------------------------------- netwinder_defconfig (arm, gcc-10) — PASS, 0 errors, 0 warnings, 0 section mismatches -------------------------------------------------------------------------------- nhk8815_defconfig (arm, gcc-10) — PASS, 0 errors, 0 warnings, 0 section mismatches -------------------------------------------------------------------------------- nlm_xlp_defconfig (mips, gcc-10) — PASS, 0 errors, 0 warnings, 0 section mismatches -------------------------------------------------------------------------------- nlm_xlr_defconfig (mips, gcc-10) — PASS, 0 errors, 0 warnings, 0 section mismatches -------------------------------------------------------------------------------- nommu_k210_defconfig (riscv, gcc-10) — PASS, 0 errors, 0 warnings, 0 section mismatches -------------------------------------------------------------------------------- nommu_k210_sdcard_defconfig (riscv, gcc-10) — PASS, 0 errors, 0 warnings, 0 section mismatches -------------------------------------------------------------------------------- nsimosci_hs_defconfig (arc, gcc-10) — PASS, 0 errors, 0 warnings, 0 section mismatches -------------------------------------------------------------------------------- nsimosci_hs_smp_defconfig (arc, gcc-10) — PASS, 0 errors, 0 warnings, 0 section mismatches -------------------------------------------------------------------------------- omap1_defconfig (arm, gcc-10) — PASS, 0 errors, 0 warnings, 0 section mismatches -------------------------------------------------------------------------------- omap2plus_defconfig (arm, gcc-10) — PASS, 0 errors, 0 warnings, 0 section mismatches -------------------------------------------------------------------------------- omega2p_defconfig (mips, gcc-10) — PASS, 0 errors, 0 warnings, 0 section mismatches -------------------------------------------------------------------------------- orion5x_defconfig (arm, gcc-10) — PASS, 0 errors, 0 warnings, 0 section mismatches -------------------------------------------------------------------------------- oxnas_v6_defconfig (arm, gcc-10) — PASS, 0 errors, 0 warnings, 0 section mismatches -------------------------------------------------------------------------------- palmz72_defconfig (arm, gcc-10) — PASS, 0 errors, 0 warnings, 0 section mismatches -------------------------------------------------------------------------------- pcm027_defconfig (arm, gcc-10) — PASS, 0 errors, 0 warnings, 0 section mismatches -------------------------------------------------------------------------------- pic32mzda_defconfig (mips, gcc-10) — PASS, 0 errors, 0 warnings, 0 section mismatches -------------------------------------------------------------------------------- pleb_defconfig (arm, gcc-10) — PASS, 0 errors, 0 warnings, 0 section mismatches -------------------------------------------------------------------------------- pxa168_defconfig (arm, gcc-10) — PASS, 0 errors, 0 warnings, 0 section mismatches -------------------------------------------------------------------------------- pxa255-idp_defconfig (arm, gcc-10) — PASS, 0 errors, 0 warnings, 0 section mismatches -------------------------------------------------------------------------------- pxa3xx_defconfig (arm, gcc-10) — PASS, 0 errors, 0 warnings, 0 section mismatches -------------------------------------------------------------------------------- pxa910_defconfig (arm, gcc-10) — PASS, 0 errors, 0 warnings, 0 section mismatches -------------------------------------------------------------------------------- pxa_defconfig (arm, gcc-10) — PASS, 0 errors, 0 warnings, 0 section mismatches -------------------------------------------------------------------------------- qcom_defconfig (arm, gcc-10) — PASS, 0 errors, 0 warnings, 0 section mismatches -------------------------------------------------------------------------------- qi_lb60_defconfig (mips, gcc-10) — PASS, 0 errors, 0 warnings, 0 section mismatches -------------------------------------------------------------------------------- rb532_defconfig (mips, gcc-10) — PASS, 0 errors, 0 warnings, 0 section mismatches -------------------------------------------------------------------------------- rbtx49xx_defconfig (mips, gcc-10) — PASS, 0 errors, 0 warnings, 0 section mismatches -------------------------------------------------------------------------------- realview_defconfig (arm, gcc-10) — PASS, 0 errors, 0 warnings, 0 section mismatches -------------------------------------------------------------------------------- rm200_defconfig (mips, gcc-10) — PASS, 0 errors, 1 warning, 0 section mismatches Warnings: drivers/block/paride/bpck.c:32: warning: "PC" redefined -------------------------------------------------------------------------------- rpc_defconfig (arm, gcc-10) — FAIL, 4 errors, 0 warnings, 0 section mismatches Errors: arm-linux-gnueabihf-gcc: error: unrecognized -march target: armv3m arm-linux-gnueabihf-gcc: error: missing argument to ‘-march=’ arm-linux-gnueabihf-gcc: error: unrecognized -march target: armv3m arm-linux-gnueabihf-gcc: error: missing argument to ‘-march=’ -------------------------------------------------------------------------------- rs90_defconfig (mips, gcc-10) — PASS, 0 errors, 0 warnings, 0 section mismatches -------------------------------------------------------------------------------- rt305x_defconfig (mips, gcc-10) — PASS, 0 errors, 0 warnings, 0 section mismatches -------------------------------------------------------------------------------- rv32_defconfig (riscv, gcc-10) — PASS, 0 errors, 0 warnings, 0 section mismatches -------------------------------------------------------------------------------- s3c2410_defconfig (arm, gcc-10) — PASS, 0 errors, 0 warnings, 0 section mismatches -------------------------------------------------------------------------------- s3c6400_defconfig (arm, gcc-10) — PASS, 0 errors, 0 warnings, 0 section mismatches -------------------------------------------------------------------------------- s5pv210_defconfig (arm, gcc-10) — PASS, 0 errors, 0 warnings, 0 section mismatches -------------------------------------------------------------------------------- sama5_defconfig (arm, gcc-10) — PASS, 0 errors, 0 warnings, 0 section mismatches -------------------------------------------------------------------------------- sama7_defconfig (arm, gcc-10) — PASS, 0 errors, 0 warnings, 0 section mismatches -------------------------------------------------------------------------------- sb1250_swarm_defconfig (mips, gcc-10) — PASS, 0 errors, 0 warnings, 0 section mismatches -------------------------------------------------------------------------------- shannon_defconfig (arm, gcc-10) — PASS, 0 errors, 0 warnings, 0 section mismatches -------------------------------------------------------------------------------- shmobile_defconfig (arm, gcc-10) — PASS, 0 errors, 0 warnings, 0 section mismatches -------------------------------------------------------------------------------- simpad_defconfig (arm, gcc-10) — PASS, 0 errors, 0 warnings, 0 section mismatches -------------------------------------------------------------------------------- socfpga_defconfig (arm, gcc-10) — PASS, 0 errors, 0 warnings, 0 section mismatches -------------------------------------------------------------------------------- spear13xx_defconfig (arm, gcc-10) — PASS, 0 errors, 0 warnings, 0 section mismatches -------------------------------------------------------------------------------- spear3xx_defconfig (arm, gcc-10) — PASS, 0 errors, 0 warnings, 0 section mismatches -------------------------------------------------------------------------------- spear6xx_defconfig (arm, gcc-10) — PASS, 0 errors, 0 warnings, 0 section mismatches -------------------------------------------------------------------------------- spitz_defconfig (arm, gcc-10) — PASS, 0 errors, 0 warnings, 0 section mismatches -------------------------------------------------------------------------------- stm32_defconfig (arm, gcc-10) — PASS, 0 errors, 0 warnings, 0 section mismatches -------------------------------------------------------------------------------- sunxi_defconfig (arm, gcc-10) — PASS, 0 errors, 0 warnings, 0 section mismatches -------------------------------------------------------------------------------- tb0219_defconfig (mips, gcc-10) — PASS, 0 errors, 0 warnings, 0 section mismatches -------------------------------------------------------------------------------- tb0226_defconfig (mips, gcc-10) — PASS, 0 errors, 0 warnings, 0 section mismatches -------------------------------------------------------------------------------- tb0287_defconfig (mips, gcc-10) — PASS, 0 errors, 0 warnings, 0 section mismatches -------------------------------------------------------------------------------- tct_hammer_defconfig (arm, gcc-10) — PASS, 0 errors, 0 warnings, 0 section mismatches -------------------------------------------------------------------------------- tegra_defconfig (arm, gcc-10) — PASS, 0 errors, 0 warnings, 0 section mismatches -------------------------------------------------------------------------------- tinyconfig (arc, gcc-10) — PASS, 0 errors, 1 warning, 0 section mismatches Warnings: arch/arc/Makefile:26: ** WARNING ** CONFIG_ARC_TUNE_MCPU flag '' is unknown, fallback to '' -------------------------------------------------------------------------------- tinyconfig (i386, gcc-10) — PASS, 0 errors, 0 warnings, 0 section mismatches -------------------------------------------------------------------------------- tinyconfig (x86_64, gcc-10) — PASS, 0 errors, 0 warnings, 0 section mismatches -------------------------------------------------------------------------------- trizeps4_defconfig (arm, gcc-10) — PASS, 0 errors, 0 warnings, 0 section mismatches -------------------------------------------------------------------------------- u8500_defconfig (arm, gcc-10) — PASS, 0 errors, 0 warnings, 0 section mismatches -------------------------------------------------------------------------------- vdk_hs38_defconfig (arc, gcc-10) — PASS, 0 errors, 0 warnings, 0 section mismatches -------------------------------------------------------------------------------- vdk_hs38_smp_defconfig (arc, gcc-10) — PASS, 0 errors, 0 warnings, 0 section mismatches -------------------------------------------------------------------------------- versatile_defconfig (arm, gcc-10) — PASS, 0 errors, 0 warnings, 0 section mismatches -------------------------------------------------------------------------------- vexpress_defconfig (arm, gcc-10) — PASS, 0 errors, 0 warnings, 0 section mismatches -------------------------------------------------------------------------------- vf610m4_defconfig (arm, gcc-10) — PASS, 0 errors, 0 warnings, 0 section mismatches -------------------------------------------------------------------------------- viper_defconfig (arm, gcc-10) — PASS, 0 errors, 0 warnings, 0 section mismatches -------------------------------------------------------------------------------- vocore2_defconfig (mips, gcc-10) — PASS, 0 errors, 0 warnings, 0 section mismatches -------------------------------------------------------------------------------- vt8500_v6_v7_defconfig (arm, gcc-10) — PASS, 0 errors, 0 warnings, 0 section mismatches -------------------------------------------------------------------------------- workpad_defconfig (mips, gcc-10) — PASS, 0 errors, 0 warnings, 0 section mismatches -------------------------------------------------------------------------------- x86_64_defconfig (x86_64, gcc-10) — PASS, 0 errors, 0 warnings, 0 section mismatches -------------------------------------------------------------------------------- x86_64_defconfig+crypto (x86_64, gcc-10) — PASS, 0 errors, 0 warnings, 0 section mismatches -------------------------------------------------------------------------------- x86_64_defconfig+ima (x86_64, gcc-10) — PASS, 0 errors, 0 warnings, 0 section mismatches -------------------------------------------------------------------------------- x86_64_defconfig+kselftest (x86_64, gcc-10) — PASS, 0 errors, 0 warnings, 0 section mismatches -------------------------------------------------------------------------------- x86_64_defconfig+x86-chromebook (x86_64, gcc-10) — PASS, 0 errors, 0 warnings, 0 section mismatches -------------------------------------------------------------------------------- x86_64_defconfig+x86_kvm_guest (x86_64, gcc-10) — PASS, 0 errors, 0 warnings, 0 section mismatches -------------------------------------------------------------------------------- xcep_defconfig (arm, gcc-10) — PASS, 0 errors, 0 warnings, 0 section mismatches -------------------------------------------------------------------------------- zeus_defconfig (arm, gcc-10) — PASS, 0 errors, 0 warnings, 0 section mismatches --- For more info write to <info(a)kernelci.org>
3 years, 4 months
1
0
0
0
soc/for-next build: 198 builds: 6 failed, 192 passed, 6 errors, 9 warnings (v5.15-rc6-1013-ge81fc37cb99b)
by kernelci.org bot
soc/for-next build: 198 builds: 6 failed, 192 passed, 6 errors, 9 warnings (v5.15-rc6-1013-ge81fc37cb99b) Full Build Summary:
https://kernelci.org/build/soc/branch/for-next/kernel/v5.15-rc6-1013-ge81fc…
Tree: soc Branch: for-next Git Describe: v5.15-rc6-1013-ge81fc37cb99b Git Commit: e81fc37cb99b771cb9e966600196f934f21287c6 Git URL:
https://git.kernel.org/pub/scm/linux/kernel/git/soc/soc.git
Built: 7 unique architectures Build Failures Detected: arm: rpc_defconfig: (gcc-10) FAIL mips: decstation_64_defconfig: (gcc-10) FAIL ip27_defconfig: (gcc-10) FAIL ip28_defconfig: (gcc-10) FAIL lemote2f_defconfig: (gcc-10) FAIL x86_64: allmodconfig: (gcc-10) FAIL Errors and Warnings Detected: arc: haps_hs_smp_defconfig+kselftest (gcc-10): 3 warnings tinyconfig (gcc-10): 1 warning arm64: arm: rpc_defconfig (gcc-10): 4 errors i386: mips: 32r2el_defconfig (gcc-10): 1 warning 32r2el_defconfig+kselftest (gcc-10): 1 warning lemote2f_defconfig (gcc-10): 1 warning loongson2k_defconfig (gcc-10): 1 warning rm200_defconfig (gcc-10): 1 warning riscv: x86_64: allmodconfig (gcc-10): 2 errors Errors summary: 2 arm-linux-gnueabihf-gcc: error: unrecognized -march target: armv3m 2 arm-linux-gnueabihf-gcc: error: missing argument to ‘-march=’ 2 /usr/lib/gcc/x86_64-linux-gnu/10/plugin/include/config/i386/i386.h:2500:10: fatal error: common/config/i386/i386-cpuinfo.h: No such file or directory Warnings summary: 2 net/mac80211/mlme.c:4345:1: warning: the frame size of 1200 bytes is larger than 1024 bytes [-Wframe-larger-than=] 2 arch/mips/boot/dts/img/boston.dts:128.19-178.5: Warning (pci_device_reg): /pci@14000000/pci2_root@0,0,0: PCI unit address format error, expected "0,0" 2 arch/arc/Makefile:26: ** WARNING ** CONFIG_ARC_TUNE_MCPU flag '' is unknown, fallback to '' 1 drivers/block/paride/bpck.c:32: warning: "PC" redefined 1 arch/arc/include/asm/perf_event.h:91:27: warning: 'arc_pmu_ev_hw_map' defined but not used [-Wunused-const-variable=] 1 arch/arc/include/asm/perf_event.h:126:27: warning: 'arc_pmu_cache_map' defined but not used [-Wunused-const-variable=] ================================================================================ Detailed per-defconfig build reports: -------------------------------------------------------------------------------- 32r2el_defconfig (mips, gcc-10) — PASS, 0 errors, 1 warning, 0 section mismatches Warnings: arch/mips/boot/dts/img/boston.dts:128.19-178.5: Warning (pci_device_reg): /pci@14000000/pci2_root@0,0,0: PCI unit address format error, expected "0,0" -------------------------------------------------------------------------------- 32r2el_defconfig+kselftest (mips, gcc-10) — PASS, 0 errors, 1 warning, 0 section mismatches Warnings: arch/mips/boot/dts/img/boston.dts:128.19-178.5: Warning (pci_device_reg): /pci@14000000/pci2_root@0,0,0: PCI unit address format error, expected "0,0" -------------------------------------------------------------------------------- allmodconfig (x86_64, gcc-10) — FAIL, 2 errors, 0 warnings, 0 section mismatches Errors: /usr/lib/gcc/x86_64-linux-gnu/10/plugin/include/config/i386/i386.h:2500:10: fatal error: common/config/i386/i386-cpuinfo.h: No such file or directory /usr/lib/gcc/x86_64-linux-gnu/10/plugin/include/config/i386/i386.h:2500:10: fatal error: common/config/i386/i386-cpuinfo.h: No such file or directory -------------------------------------------------------------------------------- allnoconfig (arc, gcc-10) — PASS, 0 errors, 0 warnings, 0 section mismatches -------------------------------------------------------------------------------- allnoconfig (x86_64, gcc-10) — PASS, 0 errors, 0 warnings, 0 section mismatches -------------------------------------------------------------------------------- allnoconfig (i386, gcc-10) — PASS, 0 errors, 0 warnings, 0 section mismatches -------------------------------------------------------------------------------- am200epdkit_defconfig (arm, gcc-10) — PASS, 0 errors, 0 warnings, 0 section mismatches -------------------------------------------------------------------------------- ar7_defconfig (mips, gcc-10) — PASS, 0 errors, 0 warnings, 0 section mismatches -------------------------------------------------------------------------------- aspeed_g4_defconfig (arm, gcc-10) — PASS, 0 errors, 0 warnings, 0 section mismatches -------------------------------------------------------------------------------- aspeed_g5_defconfig (arm, gcc-10) — PASS, 0 errors, 0 warnings, 0 section mismatches -------------------------------------------------------------------------------- assabet_defconfig (arm, gcc-10) — PASS, 0 errors, 0 warnings, 0 section mismatches -------------------------------------------------------------------------------- at91_dt_defconfig (arm, gcc-10) — PASS, 0 errors, 0 warnings, 0 section mismatches -------------------------------------------------------------------------------- ath25_defconfig (mips, gcc-10) — PASS, 0 errors, 0 warnings, 0 section mismatches -------------------------------------------------------------------------------- ath79_defconfig (mips, gcc-10) — PASS, 0 errors, 0 warnings, 0 section mismatches -------------------------------------------------------------------------------- axm55xx_defconfig (arm, gcc-10) — PASS, 0 errors, 0 warnings, 0 section mismatches -------------------------------------------------------------------------------- axs103_defconfig (arc, gcc-10) — PASS, 0 errors, 0 warnings, 0 section mismatches -------------------------------------------------------------------------------- axs103_smp_defconfig (arc, gcc-10) — PASS, 0 errors, 0 warnings, 0 section mismatches -------------------------------------------------------------------------------- badge4_defconfig (arm, gcc-10) — PASS, 0 errors, 0 warnings, 0 section mismatches -------------------------------------------------------------------------------- bcm2835_defconfig (arm, gcc-10) — PASS, 0 errors, 0 warnings, 0 section mismatches -------------------------------------------------------------------------------- bcm47xx_defconfig (mips, gcc-10) — PASS, 0 errors, 0 warnings, 0 section mismatches -------------------------------------------------------------------------------- bcm63xx_defconfig (mips, gcc-10) — PASS, 0 errors, 0 warnings, 0 section mismatches -------------------------------------------------------------------------------- bigsur_defconfig (mips, gcc-10) — PASS, 0 errors, 0 warnings, 0 section mismatches -------------------------------------------------------------------------------- bmips_be_defconfig (mips, gcc-10) — PASS, 0 errors, 0 warnings, 0 section mismatches -------------------------------------------------------------------------------- bmips_stb_defconfig (mips, gcc-10) — PASS, 0 errors, 0 warnings, 0 section mismatches -------------------------------------------------------------------------------- capcella_defconfig (mips, gcc-10) — PASS, 0 errors, 0 warnings, 0 section mismatches -------------------------------------------------------------------------------- cavium_octeon_defconfig (mips, gcc-10) — PASS, 0 errors, 0 warnings, 0 section mismatches -------------------------------------------------------------------------------- cerfcube_defconfig (arm, gcc-10) — PASS, 0 errors, 0 warnings, 0 section mismatches -------------------------------------------------------------------------------- ci20_defconfig (mips, gcc-10) — PASS, 0 errors, 0 warnings, 0 section mismatches -------------------------------------------------------------------------------- cm_x300_defconfig (arm, gcc-10) — PASS, 0 errors, 0 warnings, 0 section mismatches -------------------------------------------------------------------------------- cobalt_defconfig (mips, gcc-10) — PASS, 0 errors, 0 warnings, 0 section mismatches -------------------------------------------------------------------------------- colibri_pxa270_defconfig (arm, gcc-10) — PASS, 0 errors, 0 warnings, 0 section mismatches -------------------------------------------------------------------------------- colibri_pxa300_defconfig (arm, gcc-10) — PASS, 0 errors, 0 warnings, 0 section mismatches -------------------------------------------------------------------------------- collie_defconfig (arm, gcc-10) — PASS, 0 errors, 0 warnings, 0 section mismatches -------------------------------------------------------------------------------- corgi_defconfig (arm, gcc-10) — PASS, 0 errors, 0 warnings, 0 section mismatches -------------------------------------------------------------------------------- cu1000-neo_defconfig (mips, gcc-10) — PASS, 0 errors, 0 warnings, 0 section mismatches -------------------------------------------------------------------------------- cu1830-neo_defconfig (mips, gcc-10) — PASS, 0 errors, 0 warnings, 0 section mismatches -------------------------------------------------------------------------------- davinci_all_defconfig (arm, gcc-10) — PASS, 0 errors, 0 warnings, 0 section mismatches -------------------------------------------------------------------------------- db1xxx_defconfig (mips, gcc-10) — PASS, 0 errors, 0 warnings, 0 section mismatches -------------------------------------------------------------------------------- decstation_64_defconfig (mips, gcc-10) — FAIL, 0 errors, 0 warnings, 0 section mismatches -------------------------------------------------------------------------------- decstation_defconfig (mips, gcc-10) — PASS, 0 errors, 0 warnings, 0 section mismatches -------------------------------------------------------------------------------- decstation_r4k_defconfig (mips, gcc-10) — PASS, 0 errors, 0 warnings, 0 section mismatches -------------------------------------------------------------------------------- defconfig (riscv, gcc-10) — PASS, 0 errors, 0 warnings, 0 section mismatches -------------------------------------------------------------------------------- defconfig (arm64, gcc-10) — PASS, 0 errors, 0 warnings, 0 section mismatches -------------------------------------------------------------------------------- defconfig+CONFIG_CPU_BIG_ENDIAN=y (arm64, gcc-10) — PASS, 0 errors, 0 warnings, 0 section mismatches -------------------------------------------------------------------------------- defconfig+CONFIG_RANDOMIZE_BASE=y (arm64, gcc-10) — PASS, 0 errors, 0 warnings, 0 section mismatches -------------------------------------------------------------------------------- defconfig+crypto (arm64, gcc-10) — PASS, 0 errors, 0 warnings, 0 section mismatches -------------------------------------------------------------------------------- defconfig+ima (arm64, gcc-10) — PASS, 0 errors, 0 warnings, 0 section mismatches -------------------------------------------------------------------------------- defconfig+kselftest (arm64, gcc-10) — PASS, 0 errors, 0 warnings, 0 section mismatches -------------------------------------------------------------------------------- defconfig+kselftest (riscv, gcc-10) — PASS, 0 errors, 0 warnings, 0 section mismatches -------------------------------------------------------------------------------- dove_defconfig (arm, gcc-10) — PASS, 0 errors, 0 warnings, 0 section mismatches -------------------------------------------------------------------------------- e55_defconfig (mips, gcc-10) — PASS, 0 errors, 0 warnings, 0 section mismatches -------------------------------------------------------------------------------- ep93xx_defconfig (arm, gcc-10) — PASS, 0 errors, 0 warnings, 0 section mismatches -------------------------------------------------------------------------------- eseries_pxa_defconfig (arm, gcc-10) — PASS, 0 errors, 0 warnings, 0 section mismatches -------------------------------------------------------------------------------- exynos_defconfig (arm, gcc-10) — PASS, 0 errors, 0 warnings, 0 section mismatches -------------------------------------------------------------------------------- ezx_defconfig (arm, gcc-10) — PASS, 0 errors, 0 warnings, 0 section mismatches -------------------------------------------------------------------------------- footbridge_defconfig (arm, gcc-10) — PASS, 0 errors, 0 warnings, 0 section mismatches -------------------------------------------------------------------------------- fuloong2e_defconfig (mips, gcc-10) — PASS, 0 errors, 0 warnings, 0 section mismatches -------------------------------------------------------------------------------- gcw0_defconfig (mips, gcc-10) — PASS, 0 errors, 0 warnings, 0 section mismatches -------------------------------------------------------------------------------- gemini_defconfig (arm, gcc-10) — PASS, 0 errors, 0 warnings, 0 section mismatches -------------------------------------------------------------------------------- gpr_defconfig (mips, gcc-10) — PASS, 0 errors, 0 warnings, 0 section mismatches -------------------------------------------------------------------------------- h3600_defconfig (arm, gcc-10) — PASS, 0 errors, 0 warnings, 0 section mismatches -------------------------------------------------------------------------------- h5000_defconfig (arm, gcc-10) — PASS, 0 errors, 0 warnings, 0 section mismatches -------------------------------------------------------------------------------- hackkit_defconfig (arm, gcc-10) — PASS, 0 errors, 0 warnings, 0 section mismatches -------------------------------------------------------------------------------- haps_hs_defconfig (arc, gcc-10) — PASS, 0 errors, 0 warnings, 0 section mismatches -------------------------------------------------------------------------------- haps_hs_smp_defconfig (arc, gcc-10) — PASS, 0 errors, 0 warnings, 0 section mismatches -------------------------------------------------------------------------------- haps_hs_smp_defconfig+kselftest (arc, gcc-10) — PASS, 0 errors, 3 warnings, 0 section mismatches Warnings: arch/arc/Makefile:26: ** WARNING ** CONFIG_ARC_TUNE_MCPU flag '' is unknown, fallback to '' arch/arc/include/asm/perf_event.h:126:27: warning: 'arc_pmu_cache_map' defined but not used [-Wunused-const-variable=] arch/arc/include/asm/perf_event.h:91:27: warning: 'arc_pmu_ev_hw_map' defined but not used [-Wunused-const-variable=] -------------------------------------------------------------------------------- hisi_defconfig (arm, gcc-10) — PASS, 0 errors, 0 warnings, 0 section mismatches -------------------------------------------------------------------------------- hsdk_defconfig (arc, gcc-10) — PASS, 0 errors, 0 warnings, 0 section mismatches -------------------------------------------------------------------------------- i386_defconfig (i386, gcc-10) — PASS, 0 errors, 0 warnings, 0 section mismatches -------------------------------------------------------------------------------- imote2_defconfig (arm, gcc-10) — PASS, 0 errors, 0 warnings, 0 section mismatches -------------------------------------------------------------------------------- imx_v4_v5_defconfig (arm, gcc-10) — PASS, 0 errors, 0 warnings, 0 section mismatches -------------------------------------------------------------------------------- imx_v6_v7_defconfig (arm, gcc-10) — PASS, 0 errors, 0 warnings, 0 section mismatches -------------------------------------------------------------------------------- integrator_defconfig (arm, gcc-10) — PASS, 0 errors, 0 warnings, 0 section mismatches -------------------------------------------------------------------------------- iop32x_defconfig (arm, gcc-10) — PASS, 0 errors, 0 warnings, 0 section mismatches -------------------------------------------------------------------------------- ip22_defconfig (mips, gcc-10) — PASS, 0 errors, 0 warnings, 0 section mismatches -------------------------------------------------------------------------------- ip27_defconfig (mips, gcc-10) — FAIL, 0 errors, 0 warnings, 0 section mismatches -------------------------------------------------------------------------------- ip28_defconfig (mips, gcc-10) — FAIL, 0 errors, 0 warnings, 0 section mismatches -------------------------------------------------------------------------------- ip32_defconfig (mips, gcc-10) — PASS, 0 errors, 0 warnings, 0 section mismatches -------------------------------------------------------------------------------- ixp4xx_defconfig (arm, gcc-10) — PASS, 0 errors, 0 warnings, 0 section mismatches -------------------------------------------------------------------------------- jazz_defconfig (mips, gcc-10) — PASS, 0 errors, 0 warnings, 0 section mismatches -------------------------------------------------------------------------------- jmr3927_defconfig (mips, gcc-10) — PASS, 0 errors, 0 warnings, 0 section mismatches -------------------------------------------------------------------------------- jornada720_defconfig (arm, gcc-10) — PASS, 0 errors, 0 warnings, 0 section mismatches -------------------------------------------------------------------------------- keystone_defconfig (arm, gcc-10) — PASS, 0 errors, 0 warnings, 0 section mismatches -------------------------------------------------------------------------------- lart_defconfig (arm, gcc-10) — PASS, 0 errors, 0 warnings, 0 section mismatches -------------------------------------------------------------------------------- lemote2f_defconfig (mips, gcc-10) — FAIL, 0 errors, 1 warning, 0 section mismatches Warnings: net/mac80211/mlme.c:4345:1: warning: the frame size of 1200 bytes is larger than 1024 bytes [-Wframe-larger-than=] -------------------------------------------------------------------------------- loongson1b_defconfig (mips, gcc-10) — PASS, 0 errors, 0 warnings, 0 section mismatches -------------------------------------------------------------------------------- loongson1c_defconfig (mips, gcc-10) — PASS, 0 errors, 0 warnings, 0 section mismatches -------------------------------------------------------------------------------- loongson2k_defconfig (mips, gcc-10) — PASS, 0 errors, 1 warning, 0 section mismatches Warnings: net/mac80211/mlme.c:4345:1: warning: the frame size of 1200 bytes is larger than 1024 bytes [-Wframe-larger-than=] -------------------------------------------------------------------------------- loongson3_defconfig (mips, gcc-10) — PASS, 0 errors, 0 warnings, 0 section mismatches -------------------------------------------------------------------------------- lpc18xx_defconfig (arm, gcc-10) — PASS, 0 errors, 0 warnings, 0 section mismatches -------------------------------------------------------------------------------- lpc32xx_defconfig (arm, gcc-10) — PASS, 0 errors, 0 warnings, 0 section mismatches -------------------------------------------------------------------------------- lpd270_defconfig (arm, gcc-10) — PASS, 0 errors, 0 warnings, 0 section mismatches -------------------------------------------------------------------------------- lubbock_defconfig (arm, gcc-10) — PASS, 0 errors, 0 warnings, 0 section mismatches -------------------------------------------------------------------------------- magician_defconfig (arm, gcc-10) — PASS, 0 errors, 0 warnings, 0 section mismatches -------------------------------------------------------------------------------- mainstone_defconfig (arm, gcc-10) — PASS, 0 errors, 0 warnings, 0 section mismatches -------------------------------------------------------------------------------- malta_defconfig (mips, gcc-10) — PASS, 0 errors, 0 warnings, 0 section mismatches -------------------------------------------------------------------------------- malta_kvm_defconfig (mips, gcc-10) — PASS, 0 errors, 0 warnings, 0 section mismatches -------------------------------------------------------------------------------- malta_qemu_32r6_defconfig (mips, gcc-10) — PASS, 0 errors, 0 warnings, 0 section mismatches -------------------------------------------------------------------------------- maltaaprp_defconfig (mips, gcc-10) — PASS, 0 errors, 0 warnings, 0 section mismatches -------------------------------------------------------------------------------- maltasmvp_defconfig (mips, gcc-10) — PASS, 0 errors, 0 warnings, 0 section mismatches -------------------------------------------------------------------------------- maltasmvp_eva_defconfig (mips, gcc-10) — PASS, 0 errors, 0 warnings, 0 section mismatches -------------------------------------------------------------------------------- maltaup_defconfig (mips, gcc-10) — PASS, 0 errors, 0 warnings, 0 section mismatches -------------------------------------------------------------------------------- maltaup_xpa_defconfig (mips, gcc-10) — PASS, 0 errors, 0 warnings, 0 section mismatches -------------------------------------------------------------------------------- milbeaut_m10v_defconfig (arm, gcc-10) — PASS, 0 errors, 0 warnings, 0 section mismatches -------------------------------------------------------------------------------- mini2440_defconfig (arm, gcc-10) — PASS, 0 errors, 0 warnings, 0 section mismatches -------------------------------------------------------------------------------- mmp2_defconfig (arm, gcc-10) — PASS, 0 errors, 0 warnings, 0 section mismatches -------------------------------------------------------------------------------- moxart_defconfig (arm, gcc-10) — PASS, 0 errors, 0 warnings, 0 section mismatches -------------------------------------------------------------------------------- mpc30x_defconfig (mips, gcc-10) — PASS, 0 errors, 0 warnings, 0 section mismatches -------------------------------------------------------------------------------- mps2_defconfig (arm, gcc-10) — PASS, 0 errors, 0 warnings, 0 section mismatches -------------------------------------------------------------------------------- mtx1_defconfig (mips, gcc-10) — PASS, 0 errors, 0 warnings, 0 section mismatches -------------------------------------------------------------------------------- multi_v4t_defconfig (arm, gcc-10) — PASS, 0 errors, 0 warnings, 0 section mismatches -------------------------------------------------------------------------------- multi_v5_defconfig (arm, gcc-10) — PASS, 0 errors, 0 warnings, 0 section mismatches -------------------------------------------------------------------------------- multi_v7_defconfig (arm, gcc-10) — PASS, 0 errors, 0 warnings, 0 section mismatches -------------------------------------------------------------------------------- multi_v7_defconfig+CONFIG_CPU_BIG_ENDIAN=y (arm, gcc-10) — PASS, 0 errors, 0 warnings, 0 section mismatches -------------------------------------------------------------------------------- multi_v7_defconfig+CONFIG_EFI=y+CONFIG_ARM_LPAE=y (arm, gcc-10) — PASS, 0 errors, 0 warnings, 0 section mismatches -------------------------------------------------------------------------------- multi_v7_defconfig+CONFIG_SMP=n (arm, gcc-10) — PASS, 0 errors, 0 warnings, 0 section mismatches -------------------------------------------------------------------------------- multi_v7_defconfig+CONFIG_THUMB2_KERNEL=y (arm, gcc-10) — PASS, 0 errors, 0 warnings, 0 section mismatches -------------------------------------------------------------------------------- multi_v7_defconfig+crypto (arm, gcc-10) — PASS, 0 errors, 0 warnings, 0 section mismatches -------------------------------------------------------------------------------- multi_v7_defconfig+ima (arm, gcc-10) — PASS, 0 errors, 0 warnings, 0 section mismatches -------------------------------------------------------------------------------- mvebu_v5_defconfig (arm, gcc-10) — PASS, 0 errors, 0 warnings, 0 section mismatches -------------------------------------------------------------------------------- mvebu_v7_defconfig (arm, gcc-10) — PASS, 0 errors, 0 warnings, 0 section mismatches -------------------------------------------------------------------------------- mxs_defconfig (arm, gcc-10) — PASS, 0 errors, 0 warnings, 0 section mismatches -------------------------------------------------------------------------------- neponset_defconfig (arm, gcc-10) — PASS, 0 errors, 0 warnings, 0 section mismatches -------------------------------------------------------------------------------- netwinder_defconfig (arm, gcc-10) — PASS, 0 errors, 0 warnings, 0 section mismatches -------------------------------------------------------------------------------- nhk8815_defconfig (arm, gcc-10) — PASS, 0 errors, 0 warnings, 0 section mismatches -------------------------------------------------------------------------------- nlm_xlp_defconfig (mips, gcc-10) — PASS, 0 errors, 0 warnings, 0 section mismatches -------------------------------------------------------------------------------- nlm_xlr_defconfig (mips, gcc-10) — PASS, 0 errors, 0 warnings, 0 section mismatches -------------------------------------------------------------------------------- nommu_k210_defconfig (riscv, gcc-10) — PASS, 0 errors, 0 warnings, 0 section mismatches -------------------------------------------------------------------------------- nommu_k210_sdcard_defconfig (riscv, gcc-10) — PASS, 0 errors, 0 warnings, 0 section mismatches -------------------------------------------------------------------------------- nsimosci_hs_defconfig (arc, gcc-10) — PASS, 0 errors, 0 warnings, 0 section mismatches -------------------------------------------------------------------------------- nsimosci_hs_smp_defconfig (arc, gcc-10) — PASS, 0 errors, 0 warnings, 0 section mismatches -------------------------------------------------------------------------------- omap1_defconfig (arm, gcc-10) — PASS, 0 errors, 0 warnings, 0 section mismatches -------------------------------------------------------------------------------- omap2plus_defconfig (arm, gcc-10) — PASS, 0 errors, 0 warnings, 0 section mismatches -------------------------------------------------------------------------------- omega2p_defconfig (mips, gcc-10) — PASS, 0 errors, 0 warnings, 0 section mismatches -------------------------------------------------------------------------------- orion5x_defconfig (arm, gcc-10) — PASS, 0 errors, 0 warnings, 0 section mismatches -------------------------------------------------------------------------------- oxnas_v6_defconfig (arm, gcc-10) — PASS, 0 errors, 0 warnings, 0 section mismatches -------------------------------------------------------------------------------- palmz72_defconfig (arm, gcc-10) — PASS, 0 errors, 0 warnings, 0 section mismatches -------------------------------------------------------------------------------- pcm027_defconfig (arm, gcc-10) — PASS, 0 errors, 0 warnings, 0 section mismatches -------------------------------------------------------------------------------- pic32mzda_defconfig (mips, gcc-10) — PASS, 0 errors, 0 warnings, 0 section mismatches -------------------------------------------------------------------------------- pleb_defconfig (arm, gcc-10) — PASS, 0 errors, 0 warnings, 0 section mismatches -------------------------------------------------------------------------------- pxa168_defconfig (arm, gcc-10) — PASS, 0 errors, 0 warnings, 0 section mismatches -------------------------------------------------------------------------------- pxa255-idp_defconfig (arm, gcc-10) — PASS, 0 errors, 0 warnings, 0 section mismatches -------------------------------------------------------------------------------- pxa3xx_defconfig (arm, gcc-10) — PASS, 0 errors, 0 warnings, 0 section mismatches -------------------------------------------------------------------------------- pxa910_defconfig (arm, gcc-10) — PASS, 0 errors, 0 warnings, 0 section mismatches -------------------------------------------------------------------------------- pxa_defconfig (arm, gcc-10) — PASS, 0 errors, 0 warnings, 0 section mismatches -------------------------------------------------------------------------------- qcom_defconfig (arm, gcc-10) — PASS, 0 errors, 0 warnings, 0 section mismatches -------------------------------------------------------------------------------- qi_lb60_defconfig (mips, gcc-10) — PASS, 0 errors, 0 warnings, 0 section mismatches -------------------------------------------------------------------------------- rb532_defconfig (mips, gcc-10) — PASS, 0 errors, 0 warnings, 0 section mismatches -------------------------------------------------------------------------------- rbtx49xx_defconfig (mips, gcc-10) — PASS, 0 errors, 0 warnings, 0 section mismatches -------------------------------------------------------------------------------- realview_defconfig (arm, gcc-10) — PASS, 0 errors, 0 warnings, 0 section mismatches -------------------------------------------------------------------------------- rm200_defconfig (mips, gcc-10) — PASS, 0 errors, 1 warning, 0 section mismatches Warnings: drivers/block/paride/bpck.c:32: warning: "PC" redefined -------------------------------------------------------------------------------- rpc_defconfig (arm, gcc-10) — FAIL, 4 errors, 0 warnings, 0 section mismatches Errors: arm-linux-gnueabihf-gcc: error: unrecognized -march target: armv3m arm-linux-gnueabihf-gcc: error: missing argument to ‘-march=’ arm-linux-gnueabihf-gcc: error: unrecognized -march target: armv3m arm-linux-gnueabihf-gcc: error: missing argument to ‘-march=’ -------------------------------------------------------------------------------- rs90_defconfig (mips, gcc-10) — PASS, 0 errors, 0 warnings, 0 section mismatches -------------------------------------------------------------------------------- rt305x_defconfig (mips, gcc-10) — PASS, 0 errors, 0 warnings, 0 section mismatches -------------------------------------------------------------------------------- rv32_defconfig (riscv, gcc-10) — PASS, 0 errors, 0 warnings, 0 section mismatches -------------------------------------------------------------------------------- s3c2410_defconfig (arm, gcc-10) — PASS, 0 errors, 0 warnings, 0 section mismatches -------------------------------------------------------------------------------- s3c6400_defconfig (arm, gcc-10) — PASS, 0 errors, 0 warnings, 0 section mismatches -------------------------------------------------------------------------------- s5pv210_defconfig (arm, gcc-10) — PASS, 0 errors, 0 warnings, 0 section mismatches -------------------------------------------------------------------------------- sama5_defconfig (arm, gcc-10) — PASS, 0 errors, 0 warnings, 0 section mismatches -------------------------------------------------------------------------------- sama7_defconfig (arm, gcc-10) — PASS, 0 errors, 0 warnings, 0 section mismatches -------------------------------------------------------------------------------- sb1250_swarm_defconfig (mips, gcc-10) — PASS, 0 errors, 0 warnings, 0 section mismatches -------------------------------------------------------------------------------- shannon_defconfig (arm, gcc-10) — PASS, 0 errors, 0 warnings, 0 section mismatches -------------------------------------------------------------------------------- shmobile_defconfig (arm, gcc-10) — PASS, 0 errors, 0 warnings, 0 section mismatches -------------------------------------------------------------------------------- simpad_defconfig (arm, gcc-10) — PASS, 0 errors, 0 warnings, 0 section mismatches -------------------------------------------------------------------------------- socfpga_defconfig (arm, gcc-10) — PASS, 0 errors, 0 warnings, 0 section mismatches -------------------------------------------------------------------------------- spear13xx_defconfig (arm, gcc-10) — PASS, 0 errors, 0 warnings, 0 section mismatches -------------------------------------------------------------------------------- spear3xx_defconfig (arm, gcc-10) — PASS, 0 errors, 0 warnings, 0 section mismatches -------------------------------------------------------------------------------- spear6xx_defconfig (arm, gcc-10) — PASS, 0 errors, 0 warnings, 0 section mismatches -------------------------------------------------------------------------------- spitz_defconfig (arm, gcc-10) — PASS, 0 errors, 0 warnings, 0 section mismatches -------------------------------------------------------------------------------- stm32_defconfig (arm, gcc-10) — PASS, 0 errors, 0 warnings, 0 section mismatches -------------------------------------------------------------------------------- sunxi_defconfig (arm, gcc-10) — PASS, 0 errors, 0 warnings, 0 section mismatches -------------------------------------------------------------------------------- tb0219_defconfig (mips, gcc-10) — PASS, 0 errors, 0 warnings, 0 section mismatches -------------------------------------------------------------------------------- tb0226_defconfig (mips, gcc-10) — PASS, 0 errors, 0 warnings, 0 section mismatches -------------------------------------------------------------------------------- tb0287_defconfig (mips, gcc-10) — PASS, 0 errors, 0 warnings, 0 section mismatches -------------------------------------------------------------------------------- tct_hammer_defconfig (arm, gcc-10) — PASS, 0 errors, 0 warnings, 0 section mismatches -------------------------------------------------------------------------------- tegra_defconfig (arm, gcc-10) — PASS, 0 errors, 0 warnings, 0 section mismatches -------------------------------------------------------------------------------- tinyconfig (i386, gcc-10) — PASS, 0 errors, 0 warnings, 0 section mismatches -------------------------------------------------------------------------------- tinyconfig (arc, gcc-10) — PASS, 0 errors, 1 warning, 0 section mismatches Warnings: arch/arc/Makefile:26: ** WARNING ** CONFIG_ARC_TUNE_MCPU flag '' is unknown, fallback to '' -------------------------------------------------------------------------------- tinyconfig (x86_64, gcc-10) — PASS, 0 errors, 0 warnings, 0 section mismatches -------------------------------------------------------------------------------- trizeps4_defconfig (arm, gcc-10) — PASS, 0 errors, 0 warnings, 0 section mismatches -------------------------------------------------------------------------------- u8500_defconfig (arm, gcc-10) — PASS, 0 errors, 0 warnings, 0 section mismatches -------------------------------------------------------------------------------- vdk_hs38_defconfig (arc, gcc-10) — PASS, 0 errors, 0 warnings, 0 section mismatches -------------------------------------------------------------------------------- vdk_hs38_smp_defconfig (arc, gcc-10) — PASS, 0 errors, 0 warnings, 0 section mismatches -------------------------------------------------------------------------------- versatile_defconfig (arm, gcc-10) — PASS, 0 errors, 0 warnings, 0 section mismatches -------------------------------------------------------------------------------- vexpress_defconfig (arm, gcc-10) — PASS, 0 errors, 0 warnings, 0 section mismatches -------------------------------------------------------------------------------- vf610m4_defconfig (arm, gcc-10) — PASS, 0 errors, 0 warnings, 0 section mismatches -------------------------------------------------------------------------------- viper_defconfig (arm, gcc-10) — PASS, 0 errors, 0 warnings, 0 section mismatches -------------------------------------------------------------------------------- vocore2_defconfig (mips, gcc-10) — PASS, 0 errors, 0 warnings, 0 section mismatches -------------------------------------------------------------------------------- vt8500_v6_v7_defconfig (arm, gcc-10) — PASS, 0 errors, 0 warnings, 0 section mismatches -------------------------------------------------------------------------------- workpad_defconfig (mips, gcc-10) — PASS, 0 errors, 0 warnings, 0 section mismatches -------------------------------------------------------------------------------- x86_64_defconfig (x86_64, gcc-10) — PASS, 0 errors, 0 warnings, 0 section mismatches -------------------------------------------------------------------------------- x86_64_defconfig+crypto (x86_64, gcc-10) — PASS, 0 errors, 0 warnings, 0 section mismatches -------------------------------------------------------------------------------- x86_64_defconfig+ima (x86_64, gcc-10) — PASS, 0 errors, 0 warnings, 0 section mismatches -------------------------------------------------------------------------------- x86_64_defconfig+kselftest (x86_64, gcc-10) — PASS, 0 errors, 0 warnings, 0 section mismatches -------------------------------------------------------------------------------- x86_64_defconfig+x86-chromebook (x86_64, gcc-10) — PASS, 0 errors, 0 warnings, 0 section mismatches -------------------------------------------------------------------------------- x86_64_defconfig+x86_kvm_guest (x86_64, gcc-10) — PASS, 0 errors, 0 warnings, 0 section mismatches -------------------------------------------------------------------------------- xcep_defconfig (arm, gcc-10) — PASS, 0 errors, 0 warnings, 0 section mismatches -------------------------------------------------------------------------------- zeus_defconfig (arm, gcc-10) — PASS, 0 errors, 0 warnings, 0 section mismatches --- For more info write to <info(a)kernelci.org>
3 years, 4 months
1
0
0
0
← Newer
1
...
11
12
13
14
15
16
17
...
96
Older →
Jump to page:
1
2
3
4
5
6
7
8
9
10
11
12
13
14
15
16
17
18
19
20
21
22
23
24
25
26
27
28
29
30
31
32
33
34
35
36
37
38
39
40
41
42
43
44
45
46
47
48
49
50
51
52
53
54
55
56
57
58
59
60
61
62
63
64
65
66
67
68
69
70
71
72
73
74
75
76
77
78
79
80
81
82
83
84
85
86
87
88
89
90
91
92
93
94
95
96
Results per page:
10
25
50
100
200